﻿2026-08-18T00:58:43.1428039Z Current runner version: '2.336.0'
2026-08-18T00:58:43.1432903Z Runner name: 'hfenduleam'
2026-08-18T00:58:43.1433340Z Runner group name: 'Default'
2026-08-18T00:58:43.1433862Z Machine name: 'HFENDULEAM'
2026-08-18T00:58:43.1437290Z ##[group]GITHUB_TOKEN Permissions
2026-08-18T00:58:43.1438714Z Actions: write
2026-08-18T00:58:43.1439064Z ArtifactMetadata: write
2026-08-18T00:58:43.1439434Z Attestations: write
2026-08-18T00:58:43.1439783Z Checks: write
2026-08-18T00:58:43.1440096Z CodeQuality: write
2026-08-18T00:58:43.1440417Z Contents: write
2026-08-18T00:58:43.1440730Z CopilotRequests: write
2026-08-18T00:58:43.1441098Z Deployments: write
2026-08-18T00:58:43.1441423Z Discussions: write
2026-08-18T00:58:43.1441731Z Drives: write
2026-08-18T00:58:43.1442042Z Issues: write
2026-08-18T00:58:43.1442343Z Metadata: read
2026-08-18T00:58:43.1442647Z Models: read
2026-08-18T00:58:43.1442958Z Packages: write
2026-08-18T00:58:43.1443267Z Pages: write
2026-08-18T00:58:43.1443773Z PullRequests: write
2026-08-18T00:58:43.1444181Z RepositoryProjects: write
2026-08-18T00:58:43.1444614Z SecurityEvents: write
2026-08-18T00:58:43.1444961Z Statuses: write
2026-08-18T00:58:43.1445325Z VulnerabilityAlerts: read
2026-08-18T00:58:43.1445706Z ##[endgroup]
2026-08-18T00:58:43.1446963Z Secret source: Actions
2026-08-18T00:58:43.1447698Z Prepare workflow directory
2026-08-18T00:58:43.1819035Z Prepare all required actions
2026-08-18T00:58:43.1849286Z Getting action download info
2026-08-18T00:58:43.5932219Z Download action repository 'actions/checkout@v5' (SHA:fbc6f3992d24b796d5a048ff273f7fcc4a7b6c09)
2026-08-18T00:58:44.2303111Z Complete job name: unit (self-hosted, Windows, hfenduleam)
2026-08-18T00:58:44.2991753Z ##[group]Run $floorBytes = 32GB
2026-08-18T00:58:44.2992403Z [36;1m$floorBytes = 32GB[0m
2026-08-18T00:58:44.2992879Z [36;1m$drive = (Get-Item $env:GITHUB_WORKSPACE).PSDrive[0m
2026-08-18T00:58:44.2993391Z [36;1m$freeBytes = [int64]$drive.Free[0m
2026-08-18T00:58:44.2994076Z [36;1mWrite-Host "disk preflight: drive=$($drive.Root) free_bytes=$freeBytes floor_bytes=$floorBytes"[0m
2026-08-18T00:58:44.2994807Z [36;1mif ($freeBytes -lt $floorBytes) {[0m
2026-08-18T00:58:44.2995511Z [36;1m  Write-Error "RESOURCE=disk drive=$($drive.Root) free_bytes=$freeBytes floor_bytes=$floorBytes"[0m
2026-08-18T00:58:44.2996152Z [36;1m  exit 1[0m
2026-08-18T00:58:44.2996470Z [36;1m}[0m
2026-08-18T00:58:44.3004286Z shell: C:\Program Files\PowerShell\7\pwsh.EXE -command ". '{0}'"
2026-08-18T00:58:44.3004977Z ##[endgroup]
2026-08-18T00:58:44.5835656Z disk preflight: drive=C:\ free_bytes=104074924032 floor_bytes=34359738368
2026-08-18T00:58:44.6548327Z ##[group]Run actions/checkout@v5
2026-08-18T00:58:44.6548848Z with:
2026-08-18T00:58:44.6549274Z   repository: BigscreenVR/spt-bs-core
2026-08-18T00:58:44.6551943Z   token: ***
2026-08-18T00:58:44.6552273Z   ssh-strict: true
2026-08-18T00:58:44.6552605Z   ssh-user: git
2026-08-18T00:58:44.6552930Z   persist-credentials: true
2026-08-18T00:58:44.6553319Z   clean: true
2026-08-18T00:58:44.6553649Z   sparse-checkout-cone-mode: true
2026-08-18T00:58:44.6554027Z   fetch-depth: 1
2026-08-18T00:58:44.6554355Z   fetch-tags: false
2026-08-18T00:58:44.6554687Z   show-progress: true
2026-08-18T00:58:44.6555019Z   lfs: false
2026-08-18T00:58:44.6555322Z   submodules: false
2026-08-18T00:58:44.6555638Z   set-safe-directory: true
2026-08-18T00:58:44.6556020Z   allow-unsafe-pr-checkout: false
2026-08-18T00:58:44.6556401Z ##[endgroup]
2026-08-18T00:58:44.8333775Z Syncing repository: BigscreenVR/spt-bs-core
2026-08-18T00:58:44.8335060Z ##[group]Getting Git version info
2026-08-18T00:58:44.8335778Z Working directory is 'C:\actions-runner\_work\spt-bs-core\spt-bs-core'
2026-08-18T00:58:44.8582648Z [command]"C:\Program Files\Git\cmd\git.exe" version
2026-08-18T00:58:44.8785492Z git version 2.43.0.windows.1
2026-08-18T00:58:44.8806902Z ##[endgroup]
2026-08-18T00:58:44.8814798Z Copying 'C:\Users\decid\.gitconfig' to 'C:\actions-runner\_work\_temp\28dd204c-0d76-4726-832b-cf3190eca977\.gitconfig'
2026-08-18T00:58:44.8827317Z Temporarily overriding HOME='C:\actions-runner\_work\_temp\28dd204c-0d76-4726-832b-cf3190eca977' before making global git config changes
2026-08-18T00:58:44.8828331Z Adding repository directory to the temporary git global config as a safe directory
2026-08-18T00:58:44.8832010Z [command]"C:\Program Files\Git\cmd\git.exe" config --global --add safe.directory C:\actions-runner\_work\spt-bs-core\spt-bs-core
2026-08-18T00:58:44.9068071Z [command]"C:\Program Files\Git\cmd\git.exe" config --local --get remote.origin.url
2026-08-18T00:58:44.9266876Z https://github.com/BigscreenVR/spt-bs-core
2026-08-18T00:58:44.9289268Z ##[group]Removing previously created refs, to avoid conflicts
2026-08-18T00:58:44.9293293Z [command]"C:\Program Files\Git\cmd\git.exe" rev-parse --symbolic-full-name --verify --quiet HEAD
2026-08-18T00:58:44.9500965Z HEAD
2026-08-18T00:58:45.0348600Z ##[endgroup]
2026-08-18T00:58:45.0353191Z [command]"C:\Program Files\Git\cmd\git.exe" submodule status
2026-08-18T00:58:45.5740739Z ##[group]Cleaning the repository
2026-08-18T00:58:45.5745219Z [command]"C:\Program Files\Git\cmd\git.exe" clean -ffdx
2026-08-18T00:58:53.6443401Z Removing target/
2026-08-18T00:58:53.6474799Z [command]"C:\Program Files\Git\cmd\git.exe" reset --hard HEAD
2026-08-18T00:58:53.7819777Z HEAD is now at a617dff57 Merge af8e57785d479fac8d0726c9f7e2085e3ce26529 into fa8c22293a8345d14455255e7de34d1d73e6ca57
2026-08-18T00:58:53.7850577Z ##[endgroup]
2026-08-18T00:58:53.7856125Z ##[group]Disabling automatic garbage collection
2026-08-18T00:58:53.7862917Z [command]"C:\Program Files\Git\cmd\git.exe" config --local gc.auto 0
2026-08-18T00:58:53.8146366Z ##[endgroup]
2026-08-18T00:58:53.8146786Z ##[group]Setting up auth
2026-08-18T00:58:53.8152921Z [command]"C:\Program Files\Git\cmd\git.exe" config --local --name-only --get-regexp core\.sshCommand
2026-08-18T00:58:53.8383112Z [command]"C:\Program Files\Git\cmd\git.exe" submodule foreach --recursive "sh -c \"git config --local --name-only --get-regexp 'core\.sshCommand' && git config --local --unset-all 'core.sshCommand' || :\""
2026-08-18T00:58:54.3615652Z [command]"C:\Program Files\Git\cmd\git.exe" config --local --name-only --get-regexp http\.https\:\/\/github\.com\/\.extraheader
2026-08-18T00:58:54.3886044Z [command]"C:\Program Files\Git\cmd\git.exe" submodule foreach --recursive "sh -c \"git config --local --name-only --get-regexp 'http\.https\:\/\/github\.com\/\.extraheader' && git config --local --unset-all 'http.https://github.com/.extraheader' || :\""
2026-08-18T00:58:54.9023293Z [command]"C:\Program Files\Git\cmd\git.exe" config --local --name-only --get-regexp ^includeIf\.gitdir:
2026-08-18T00:58:54.9276068Z [command]"C:\Program Files\Git\cmd\git.exe" submodule foreach --recursive "git config --local --show-origin --name-only --get-regexp remote.origin.url"
2026-08-18T00:58:55.4960151Z [command]"C:\Program Files\Git\cmd\git.exe" config --local http.https://github.com/.extraheader "AUTHORIZATION: basic ***"
2026-08-18T00:58:55.5320799Z ##[endgroup]
2026-08-18T00:58:55.5321613Z ##[group]Fetching the repository
2026-08-18T00:58:55.5327893Z [command]"C:\Program Files\Git\cmd\git.exe" -c protocol.version=2 fetch --no-tags --prune --no-recurse-submodules --depth=1 origin +137d6d10dbdc32d5691488dbbc928a8682bf57f3:refs/remotes/pull/147/merge
2026-08-18T00:58:56.8759170Z From https://github.com/BigscreenVR/spt-bs-core
2026-08-18T00:58:56.8759586Z  * [new ref]             137d6d10dbdc32d5691488dbbc928a8682bf57f3 -> pull/147/merge
2026-08-18T00:58:56.9271884Z ##[endgroup]
2026-08-18T00:58:56.9273554Z ##[group]Determining the checkout info
2026-08-18T00:58:56.9274108Z ##[endgroup]
2026-08-18T00:58:56.9281053Z [command]"C:\Program Files\Git\cmd\git.exe" sparse-checkout disable
2026-08-18T00:58:56.9601781Z [command]"C:\Program Files\Git\cmd\git.exe" config --local --unset-all extensions.worktreeConfig
2026-08-18T00:58:57.0314149Z ##[group]Checking out the ref
2026-08-18T00:58:57.0318795Z [command]"C:\Program Files\Git\cmd\git.exe" checkout --progress --force refs/remotes/pull/147/merge
2026-08-18T00:58:57.1678482Z Previous HEAD position was a617dff57 Merge af8e57785d479fac8d0726c9f7e2085e3ce26529 into fa8c22293a8345d14455255e7de34d1d73e6ca57
2026-08-18T00:58:57.1679574Z HEAD is now at 137d6d10d Merge f1a560fcf0546e5cb9c0120efd3c0e173fa8f8dc into af8e57785d479fac8d0726c9f7e2085e3ce26529
2026-08-18T00:58:57.1711439Z ##[endgroup]
2026-08-18T00:58:57.2061664Z [command]"C:\Program Files\Git\cmd\git.exe" log -1 --format=%H
2026-08-18T00:58:57.2649591Z 137d6d10dbdc32d5691488dbbc928a8682bf57f3
2026-08-18T00:58:57.2933203Z ##[group]Run cargo build -p spt --bin translate_proof_fixture
2026-08-18T00:58:57.2933604Z [36;1mcargo build -p spt --bin translate_proof_fixture[0m
2026-08-18T00:58:57.2938536Z shell: C:\Program Files\PowerShell\7\pwsh.EXE -command ". '{0}'"
2026-08-18T00:58:57.2938806Z ##[endgroup]
2026-08-18T00:59:00.9900417Z    Compiling proc-macro2 v1.0.106
2026-08-18T00:59:00.9900858Z    Compiling unicode-ident v1.0.24
2026-08-18T00:59:00.9901184Z    Compiling quote v1.0.45
2026-08-18T00:59:00.9901420Z    Compiling cfg-if v1.0.4
2026-08-18T00:59:01.1393738Z    Compiling serde_core v1.0.228
2026-08-18T00:59:01.1683502Z    Compiling serde v1.0.228
2026-08-18T00:59:01.5845260Z    Compiling windows-link v0.2.1
2026-08-18T00:59:01.9330032Z    Compiling typenum v1.20.1
2026-08-18T00:59:01.9417080Z    Compiling windows-sys v0.61.2
2026-08-18T00:59:02.9021110Z    Compiling syn v2.0.117
2026-08-18T00:59:03.0018250Z    Compiling getrandom v0.3.4
2026-08-18T00:59:03.3742060Z    Compiling portable-atomic v1.13.1
2026-08-18T00:59:03.7846077Z    Compiling version_check v0.9.5
2026-08-18T00:59:03.9489274Z    Compiling pin-project-lite v0.2.17
2026-08-18T00:59:04.5822635Z    Compiling find-msvc-tools v0.1.9
2026-08-18T00:59:04.6873423Z    Compiling jobserver v0.1.34
2026-08-18T00:59:04.9618397Z    Compiling memchr v2.8.1
2026-08-18T00:59:05.3935770Z    Compiling shlex v2.0.1
2026-08-18T00:59:05.5630980Z    Compiling cc v1.2.63
2026-08-18T00:59:05.8215387Z    Compiling critical-section v1.2.0
2026-08-18T00:59:05.9569300Z    Compiling subtle v2.6.1
2026-08-18T00:59:06.0825930Z    Compiling futures-core v0.3.32
2026-08-18T00:59:06.2592947Z    Compiling equivalent v1.0.2
2026-08-18T00:59:06.3176948Z    Compiling smallvec v1.15.1
2026-08-18T00:59:06.4794581Z    Compiling generic-array v0.14.7
2026-08-18T00:59:06.6726840Z    Compiling bytes v1.11.1
2026-08-18T00:59:06.9541295Z    Compiling itoa v1.0.18
2026-08-18T00:59:07.2329652Z    Compiling semver v1.0.28
2026-08-18T00:59:07.5137952Z    Compiling rustc_version v0.4.1
2026-08-18T00:59:07.7565169Z    Compiling synstructure v0.13.2
2026-08-18T00:59:07.8215970Z    Compiling stable_deref_trait v1.2.1
2026-08-18T00:59:07.8821920Z    Compiling log v0.4.32
2026-08-18T00:59:07.8921700Z    Compiling serde_derive v1.0.228
2026-08-18T00:59:08.0568163Z    Compiling zeroize_derive v1.4.3
2026-08-18T00:59:08.2544236Z    Compiling socket2 v0.6.4
2026-08-18T00:59:08.5134887Z    Compiling zeroize v1.8.2
2026-08-18T00:59:08.7437257Z    Compiling zerofrom-derive v0.1.7
2026-08-18T00:59:08.7551020Z    Compiling yoke-derive v0.8.2
2026-08-18T00:59:09.4359548Z    Compiling mio v1.2.1
2026-08-18T00:59:09.5859542Z    Compiling tokio-macros v2.7.0
2026-08-18T00:59:09.7141280Z    Compiling zerofrom v0.1.8
2026-08-18T00:59:10.0023223Z    Compiling crypto-common v0.1.7
2026-08-18T00:59:10.0744868Z    Compiling futures-sink v0.3.32
2026-08-18T00:59:10.1027803Z    Compiling slab v0.4.12
2026-08-18T00:59:10.1826154Z    Compiling futures-io v0.3.32
2026-08-18T00:59:10.2889275Z    Compiling futures-channel v0.3.32
2026-08-18T00:59:10.3461207Z    Compiling tokio v1.52.3
2026-08-18T00:59:10.4238872Z    Compiling yoke v0.8.3
2026-08-18T00:59:10.5185974Z    Compiling futures-macro v0.3.32
2026-08-18T00:59:10.7430225Z    Compiling hashbrown v0.17.1
2026-08-18T00:59:11.0935629Z    Compiling futures-task v0.3.32
2026-08-18T00:59:11.2821912Z    Compiling rustversion v1.0.22
2026-08-18T00:59:11.2855025Z    Compiling rand_core v0.10.1
2026-08-18T00:59:11.3958663Z    Compiling once_cell v1.21.4
2026-08-18T00:59:11.5289346Z    Compiling futures-util v0.3.32
2026-08-18T00:59:11.6439341Z    Compiling indexmap v2.14.0
2026-08-18T00:59:11.9424967Z    Compiling zerovec-derive v0.11.3
2026-08-18T00:59:12.2812746Z    Compiling getrandom v0.2.17
2026-08-18T00:59:12.4169666Z    Compiling cpufeatures v0.2.17
2026-08-18T00:59:12.8205996Z    Compiling zerovec v0.11.6
2026-08-18T00:59:13.1238400Z    Compiling displaydoc v0.2.6
2026-08-18T00:59:13.5135860Z    Compiling hybrid-array v0.4.12
2026-08-18T00:59:13.6707265Z    Compiling getrandom v0.4.2
2026-08-18T00:59:13.8773853Z    Compiling fnv v1.0.7
2026-08-18T00:59:13.9840019Z    Compiling libc v0.2.186
2026-08-18T00:59:14.1963879Z    Compiling cfg_aliases v0.2.1
2026-08-18T00:59:14.2718055Z    Compiling strsim v0.11.1
2026-08-18T00:59:14.5730515Z    Compiling block-buffer v0.12.0
2026-08-18T00:59:14.6796836Z    Compiling crypto-common v0.2.2
2026-08-18T00:59:14.7191957Z    Compiling tinystr v0.8.3
2026-08-18T00:59:14.8897396Z    Compiling tracing-core v0.1.36
2026-08-18T00:59:15.0288328Z    Compiling tracing-attributes v0.1.31
2026-08-18T00:59:15.6715459Z    Compiling litemap v0.8.2
2026-08-18T00:59:15.7766255Z    Compiling writeable v0.6.3
2026-08-18T00:59:15.8383907Z    Compiling autocfg v1.5.1
2026-08-18T00:59:15.9985902Z    Compiling icu_locale_core v2.2.0
2026-08-18T00:59:16.0883947Z    Compiling tracing v0.1.44
2026-08-18T00:59:16.2290019Z    Compiling zerotrie v0.2.4
2026-08-18T00:59:16.5011290Z    Compiling potential_utf v0.1.5
2026-08-18T00:59:16.6558156Z    Compiling cmake v0.1.58
2026-08-18T00:59:16.6584451Z    Compiling fs_extra v1.3.0
2026-08-18T00:59:16.9175512Z    Compiling ident_case v1.0.1
2026-08-18T00:59:17.0166233Z    Compiling icu_properties_data v2.2.0
2026-08-18T00:59:17.0173359Z    Compiling dunce v1.0.5
2026-08-18T00:59:17.1283773Z    Compiling utf8_iter v1.0.4
2026-08-18T00:59:17.1837809Z    Compiling icu_normalizer_data v2.2.0
2026-08-18T00:59:17.2766515Z    Compiling icu_collections v2.2.0
2026-08-18T00:59:17.8605372Z    Compiling aws-lc-sys v0.41.0
2026-08-18T00:59:18.1110685Z    Compiling icu_provider v2.2.0
2026-08-18T00:59:18.2132056Z    Compiling tokio-util v0.7.18
2026-08-18T00:59:18.6274665Z    Compiling percent-encoding v2.3.2
2026-08-18T00:59:18.8273337Z    Compiling icu_normalizer v2.2.0
2026-08-18T00:59:19.4065508Z    Compiling inout v0.2.2
2026-08-18T00:59:19.5296374Z    Compiling http v1.4.1
2026-08-18T00:59:19.7183889Z    Compiling ring v0.17.14
2026-08-18T00:59:20.1015462Z    Compiling icu_properties v2.2.0
2026-08-18T00:59:20.1959788Z    Compiling unicode-segmentation v1.13.3
2026-08-18T00:59:20.5849575Z    Compiling cpufeatures v0.3.0
2026-08-18T00:59:20.6473197Z    Compiling aws-lc-rs v1.17.0
2026-08-18T00:59:20.6588857Z    Compiling thiserror v2.0.18
2026-08-18T00:59:21.1529688Z    Compiling idna_adapter v1.2.2
2026-08-18T00:59:21.2517262Z    Compiling cipher v0.5.2
2026-08-18T00:59:21.3621234Z    Compiling curve25519-dalek-derive v0.1.1
2026-08-18T00:59:21.5568789Z    Compiling thiserror-impl v2.0.18
2026-08-18T00:59:21.8190757Z    Compiling scopeguard v1.2.0
2026-08-18T00:59:22.1608454Z    Compiling lock_api v0.4.14
2026-08-18T00:59:22.3576254Z    Compiling chacha20 v0.10.0
2026-08-18T00:59:22.6284304Z    Compiling idna v1.1.0
2026-08-18T00:59:22.7868483Z    Compiling form_urlencoded v1.2.2
2026-08-18T00:59:22.9113068Z    Compiling ipnet v2.12.0
2026-08-18T00:59:23.4201632Z    Compiling rustls-pki-types v1.14.1
2026-08-18T00:59:23.4821201Z    Compiling block-buffer v0.10.4
2026-08-18T00:59:23.5156730Z    Compiling winapi v0.3.9
2026-08-18T00:59:23.6083683Z    Compiling bitflags v2.12.1
2026-08-18T00:59:23.8329176Z    Compiling untrusted v0.9.0
2026-08-18T00:59:23.9321703Z    Compiling digest v0.10.7
2026-08-18T00:59:23.9998509Z    Compiling url v2.5.8
2026-08-18T00:59:24.1417157Z    Compiling rand v0.10.1
2026-08-18T00:59:24.8853665Z    Compiling darling_core v0.20.11
2026-08-18T00:59:24.9038565Z    Compiling num-traits v0.2.19
2026-08-18T00:59:25.0917729Z    Compiling windows-result v0.4.1
2026-08-18T00:59:25.3783783Z    Compiling windows-strings v0.5.1
2026-08-18T00:59:25.8203924Z    Compiling heck v0.5.0
2026-08-18T00:59:26.0435126Z    Compiling rustls v0.23.40
2026-08-18T00:59:27.0636035Z    Compiling convert_case v0.10.0
2026-08-18T00:59:27.3313857Z    Compiling anyhow v1.0.102
2026-08-18T00:59:27.3663456Z    Compiling darling_macro v0.20.11
2026-08-18T00:59:27.5946139Z    Compiling const-oid v0.10.2
2026-08-18T00:59:27.6859062Z    Compiling unicode-xid v0.2.6
2026-08-18T00:59:27.8139135Z    Compiling atomic-waker v1.1.2
2026-08-18T00:59:27.8253732Z    Compiling derive_more-impl v2.1.1
2026-08-18T00:59:27.9052917Z    Compiling darling v0.20.11
2026-08-18T00:59:28.2207370Z    Compiling parking_lot_core v0.9.12
2026-08-18T00:59:28.5722620Z    Compiling zerocopy v0.8.50
2026-08-18T00:59:28.8797480Z    Compiling httparse v1.10.1
2026-08-18T00:59:29.5022476Z    Compiling derive_builder_core v0.20.2
2026-08-18T00:59:29.5822970Z    Compiling h2 v0.4.14
2026-08-18T00:59:30.5306107Z    Compiling http-body v1.0.1
2026-08-18T00:59:30.6904400Z    Compiling curve25519-dalek v4.1.3
2026-08-18T00:59:30.7171462Z    Compiling derive_more v2.1.1
2026-08-18T00:59:30.9262762Z    Compiling ahash v0.8.12
2026-08-18T00:59:31.0743947Z    Compiling base64ct v1.8.3
2026-08-18T00:59:31.1622787Z    Compiling powerfmt v0.2.0
2026-08-18T00:59:31.3739739Z    Compiling either v1.16.0
2026-08-18T00:59:31.4116181Z    Compiling pem-rfc7468 v1.0.0
2026-08-18T00:59:31.5636537Z    Compiling deranged v0.5.8
2026-08-18T00:59:32.1359137Z    Compiling derive_builder_macro v0.20.2
2026-08-18T00:59:32.7379672Z    Compiling uuid v1.23.2
2026-08-18T00:59:33.1771269Z    Compiling rand_core v0.6.4
2026-08-18T00:59:33.3772239Z    Compiling spez v0.1.2
2026-08-18T00:59:34.2470843Z    Compiling n0-error-macros v0.1.3
2026-08-18T00:59:34.3287573Z    Compiling windows-interface v0.59.3
2026-08-18T00:59:34.8548644Z    Compiling windows-implement v0.60.2
2026-08-18T00:59:34.8601992Z    Compiling data-encoding v2.11.0
2026-08-18T00:59:35.4303670Z    Compiling num-conv v0.2.2
2026-08-18T00:59:35.4649724Z    Compiling base64 v0.22.1
2026-08-18T00:59:35.5465058Z    Compiling time-core v0.1.8
2026-08-18T00:59:35.6826754Z    Compiling tinyvec_macros v0.1.1
2026-08-18T00:59:35.7358928Z    Compiling pkg-config v0.3.33
2026-08-18T00:59:35.7846439Z    Compiling zmij v1.0.21
2026-08-18T00:59:35.8897195Z    Compiling tower-service v0.3.3
2026-08-18T00:59:35.9998317Z    Compiling fastrand v2.4.1
2026-08-18T00:59:36.0420640Z    Compiling vcpkg v0.2.15
2026-08-18T00:59:36.1939566Z    Compiling try-lock v0.2.5
2026-08-18T00:59:36.2963894Z    Compiling want v0.3.1
2026-08-18T00:59:36.3029597Z    Compiling tinyvec v1.11.0
2026-08-18T00:59:36.4294089Z    Compiling windows-core v0.62.2
2026-08-18T00:59:36.6673969Z    Compiling libsqlite3-sys v0.30.1
2026-08-18T00:59:36.8242422Z    Compiling n0-error v0.1.3
2026-08-18T00:59:37.2953214Z    Compiling parking_lot v0.12.5
2026-08-18T00:59:37.3257193Z    Compiling derive_builder v0.20.2
2026-08-18T00:59:37.5220908Z    Compiling der v0.8.0-rc.10
2026-08-18T00:59:37.8189125Z    Compiling sha2 v0.10.9
2026-08-18T00:59:38.2012611Z    Compiling n0-future v0.3.2
2026-08-18T00:59:38.4567130Z    Compiling vergen-lib v9.1.0
2026-08-18T00:59:38.5951501Z    Compiling pin-project-internal v1.1.13
2026-08-18T00:59:38.6484331Z    Compiling inout v0.1.4
2026-08-18T00:59:38.7940674Z    Compiling signature v2.2.0
2026-08-18T00:59:38.9445710Z    Compiling cordyceps v0.3.4
2026-08-18T00:59:39.2411730Z    Compiling diatomic-waker v0.2.3
2026-08-18T00:59:39.2492767Z    Compiling spin v0.10.0
2026-08-18T00:59:39.3602882Z    Compiling winnow v1.0.3
2026-08-18T00:59:39.3944513Z    Compiling crossbeam-utils v0.8.21
2026-08-18T00:59:39.7869285Z    Compiling serde_json v1.0.150
2026-08-18T00:59:39.8199062Z    Compiling httpdate v1.0.3
2026-08-18T00:59:40.0021941Z    Compiling spt-procident v0.55.0 (C:\actions-runner\_work\spt-bs-core\spt-bs-core\crates\spt-procident)
2026-08-18T00:59:40.0398099Z    Compiling parking v2.2.1
2026-08-18T00:59:40.1577890Z    Compiling windows_x86_64_msvc v0.52.6
2026-08-18T00:59:40.2549678Z    Compiling futures-lite v2.6.1
2026-08-18T00:59:40.3964895Z    Compiling toml_parser v1.1.2+spec-1.1.0
2026-08-18T00:59:40.4835230Z    Compiling spt-poolguard v0.55.0 (C:\actions-runner\_work\spt-bs-core\spt-bs-core\crates\spt-poolguard)
2026-08-18T00:59:40.9454949Z    Compiling hyper v1.10.1
2026-08-18T00:59:40.9998934Z    Compiling pin-project v1.1.13
2026-08-18T00:59:41.2185904Z    Compiling futures-buffered v0.2.13
2026-08-18T00:59:41.2404084Z    Compiling ed25519 v2.2.3
2026-08-18T00:59:41.4551793Z    Compiling cipher v0.4.4
2026-08-18T00:59:41.6160211Z    Compiling spki v0.8.0-rc.4
2026-08-18T00:59:41.8689045Z    Compiling hashbrown v0.14.5
2026-08-18T00:59:42.6246091Z    Compiling digest v0.11.3
2026-08-18T00:59:42.8744325Z    Compiling noq-udp v0.10.0
2026-08-18T00:59:43.0620618Z    Compiling vergen v9.1.0
2026-08-18T00:59:43.2339331Z    Compiling vergen-lib v0.1.6
2026-08-18T00:59:43.2636548Z    Compiling universal-hash v0.5.1
2026-08-18T00:59:43.3249164Z    Compiling heapless v0.7.17
2026-08-18T00:59:43.3836175Z    Compiling curve25519-dalek v5.0.0-pre.6
2026-08-18T00:59:43.3948908Z    Compiling sync_wrapper v1.0.2
2026-08-18T00:59:43.5158457Z    Compiling aho-corasick v1.1.4
2026-08-18T00:59:43.5658337Z    Compiling toml_datetime v1.1.1+spec-1.1.0
2026-08-18T00:59:43.6778688Z    Compiling opaque-debug v0.3.1
2026-08-18T00:59:43.7717088Z    Compiling byteorder v1.5.0
2026-08-18T00:59:43.8008107Z    Compiling regex-syntax v0.8.10
2026-08-18T00:59:43.9432599Z    Compiling allocator-api2 v0.2.21
2026-08-18T00:59:44.3174237Z    Compiling hash32 v0.2.1
2026-08-18T00:59:44.4963994Z    Compiling polyval v0.6.2
2026-08-18T00:59:44.7541912Z    Compiling toml_edit v0.25.12+spec-1.1.0
2026-08-18T00:59:45.8839247Z    Compiling regex-automata v0.4.14
2026-08-18T00:59:46.7591435Z    Compiling hashlink v0.9.1
2026-08-18T00:59:47.0428836Z    Compiling hyper-util v0.1.20
2026-08-18T00:59:47.6878483Z    Compiling pkcs8 v0.11.0-rc.10
2026-08-18T00:59:48.3251977Z    Compiling ed25519-dalek v2.2.0
2026-08-18T00:59:48.6854202Z    Compiling spt-store v0.55.0 (C:\actions-runner\_work\spt-bs-core\spt-bs-core\crates\spt-store)
2026-08-18T00:59:49.0478834Z    Compiling prefix-trie v0.8.4
2026-08-18T00:59:49.4442446Z    Compiling spin v0.9.8
2026-08-18T00:59:49.6616873Z    Compiling futures-executor v0.3.32
2026-08-18T00:59:49.7114862Z    Compiling vergen-gitcl v1.0.8
2026-08-18T00:59:49.8624509Z    Compiling windows-threading v0.2.1
2026-08-18T00:59:50.0597896Z    Compiling fallible-streaming-iterator v0.1.9
2026-08-18T00:59:50.1177252Z    Compiling fallible-iterator v0.3.0
2026-08-18T00:59:50.1688607Z    Compiling tower-layer v0.3.3
2026-08-18T00:59:50.3786680Z    Compiling ryu v1.0.23
2026-08-18T00:59:50.3800004Z    Compiling signature v3.0.0
2026-08-18T00:59:50.5800612Z    Compiling ed25519 v3.0.0-rc.4
2026-08-18T00:59:50.6390717Z    Compiling data-encoding-macro-internal v0.1.18
2026-08-18T00:59:50.6680995Z    Compiling rusqlite v0.32.1
2026-08-18T00:59:50.9430883Z    Compiling windows-future v0.3.2
2026-08-18T00:59:51.0033169Z    Compiling futures v0.3.32
2026-08-18T00:59:51.5464720Z    Compiling hickory-proto v0.26.0-beta.4
2026-08-18T00:59:51.6322778Z    Compiling windows-targets v0.52.6
2026-08-18T00:59:51.7976388Z    Compiling spt-proto v0.55.0 (C:\actions-runner\_work\spt-bs-core\spt-bs-core\crates\spt-proto)
2026-08-18T00:59:52.0819827Z    Compiling regex v1.12.3
2026-08-18T00:59:53.2672318Z    Compiling proc-macro-crate v3.5.0
2026-08-18T00:59:53.7245863Z    Compiling ghash v0.5.1
2026-08-18T00:59:53.8133775Z    Compiling sha2 v0.11.0-rc.5
2026-08-18T00:59:54.5836984Z    Compiling ctr v0.9.2
2026-08-18T00:59:54.5890756Z    Compiling aes v0.8.4
2026-08-18T00:59:54.7473912Z    Compiling windows-numerics v0.3.1
2026-08-18T00:59:54.9406234Z    Compiling windows-collections v0.3.2
2026-08-18T00:59:55.1321696Z    Compiling time v0.3.47
2026-08-18T00:59:55.3319825Z    Compiling http-body-util v0.1.3
2026-08-18T00:59:55.4195710Z    Compiling fs2 v0.4.3
2026-08-18T00:59:55.5700314Z    Compiling cobs v0.3.0
2026-08-18T00:59:55.6062431Z    Compiling aead v0.5.2
2026-08-18T00:59:55.7056598Z    Compiling postcard-derive v0.2.2
2026-08-18T00:59:55.7688468Z    Compiling arrayvec v0.7.6
2026-08-18T00:59:55.9738215Z    Compiling ipconfig v0.3.4
2026-08-18T00:59:56.1074963Z    Compiling utf8parse v0.2.2
2026-08-18T00:59:56.1365459Z    Compiling widestring v1.2.1
2026-08-18T00:59:56.2355307Z    Compiling postcard v1.1.3
2026-08-18T00:59:56.9589164Z    Compiling aes-gcm v0.10.3
2026-08-18T00:59:57.1920772Z    Compiling windows v0.62.2
2026-08-18T00:59:57.2512807Z    Compiling ed25519-dalek v3.0.0-pre.6
2026-08-18T00:59:57.5978102Z    Compiling num_enum_derive v0.7.6
2026-08-18T00:59:58.3389610Z    Compiling windows-sys v0.59.0
2026-08-18T00:59:59.7206783Z    Compiling data-encoding-macro v0.1.20
2026-08-18T00:59:59.8587776Z    Compiling tower v0.5.3
2026-08-18T01:00:00.6310072Z    Compiling crossbeam-epoch v0.9.18
2026-08-18T01:00:01.0434134Z    Compiling crossbeam-channel v0.5.15
2026-08-18T01:00:01.5694892Z    Compiling chrono v0.4.45
2026-08-18T01:00:02.9204924Z    Compiling strum_macros v0.28.0
2026-08-18T01:00:04.4805342Z    Compiling iroh-metrics-derive v0.4.1
2026-08-18T01:00:04.8797443Z    Compiling windows-registry v0.6.1
2026-08-18T01:00:05.2101795Z    Compiling memoffset v0.6.5
2026-08-18T01:00:05.3886025Z    Compiling noq v0.18.0
2026-08-18T01:00:05.5962412Z    Compiling netwatch v0.16.0
2026-08-18T01:00:05.8401228Z    Compiling enum-assoc v1.3.0
2026-08-18T01:00:06.2941898Z    Compiling async-trait v0.1.89
2026-08-18T01:00:06.4236114Z    Compiling acto v0.8.2
2026-08-18T01:00:06.6616464Z    Compiling blake3 v1.8.5
2026-08-18T01:00:07.0485608Z    Compiling mac-addr v0.3.0
2026-08-18T01:00:07.1546335Z    Compiling lru-slab v0.1.2
2026-08-18T01:00:07.1979818Z    Compiling tagptr v0.2.0
2026-08-18T01:00:07.2562149Z    Compiling sorted-index-buffer v0.2.1
2026-08-18T01:00:07.3592409Z    Compiling rustc-hash v2.1.2
2026-08-18T01:00:07.3690529Z    Compiling foldhash v0.2.0
2026-08-18T01:00:07.4946879Z    Compiling thiserror v1.0.69
2026-08-18T01:00:07.5650322Z    Compiling ref-cast v1.0.25
2026-08-18T01:00:07.7712311Z    Compiling xml-rs v0.8.28
2026-08-18T01:00:07.8211872Z    Compiling identity-hash v0.1.0
2026-08-18T01:00:08.0612666Z    Compiling hashbrown v0.16.1
2026-08-18T01:00:08.6689442Z    Compiling xmltree v0.10.3
2026-08-18T01:00:08.8171354Z    Compiling moka v0.12.15
2026-08-18T01:00:09.1553718Z    Compiling netdev v0.42.0
2026-08-18T01:00:10.1432691Z    Compiling iroh-metrics v0.38.3
2026-08-18T01:00:10.4447758Z    Compiling strum v0.28.0
2026-08-18T01:00:10.4694762Z    Compiling wmi v0.18.4
2026-08-18T01:00:10.6362296Z    Compiling spt-msg v0.55.0 (C:\actions-runner\_work\spt-bs-core\spt-bs-core\crates\spt-msg)
2026-08-18T01:00:11.0460601Z    Compiling tower-http v0.6.11
2026-08-18T01:00:11.4496303Z    Compiling iroh-base v0.98.0
2026-08-18T01:00:11.5474918Z    Compiling num_enum v0.7.6
2026-08-18T01:00:11.7494146Z    Compiling iroh-relay v0.98.0
2026-08-18T01:00:11.9477316Z    Compiling n0-watcher v0.6.1
2026-08-18T01:00:11.9711083Z    Compiling attohttpc v0.30.1
2026-08-18T01:00:12.1791035Z    Compiling simple-dns v0.9.3
2026-08-18T01:00:12.5012778Z    Compiling tokio-stream v0.1.18
2026-08-18T01:00:13.0970365Z    Compiling serial-core v0.4.0
2026-08-18T01:00:13.2574582Z    Compiling serde_spanned v0.6.9
2026-08-18T01:00:13.2962929Z    Compiling toml_datetime v0.6.11
2026-08-18T01:00:13.3868757Z    Compiling ref-cast-impl v1.0.25
2026-08-18T01:00:13.5242424Z    Compiling thiserror-impl v1.0.69
2026-08-18T01:00:13.7235768Z    Compiling serde_derive_internals v0.29.1
2026-08-18T01:00:14.3264174Z    Compiling winnow v0.7.15
2026-08-18T01:00:14.4632719Z    Compiling winreg v0.10.1
2026-08-18T01:00:14.5786136Z    Compiling resolv-conf v0.7.6
2026-08-18T01:00:14.6568338Z    Compiling constant_time_eq v0.4.2
2026-08-18T01:00:14.8163047Z    Compiling toml_write v0.1.2
2026-08-18T01:00:14.9555254Z    Compiling simdutf8 v0.1.5
2026-08-18T01:00:14.9942762Z    Compiling arrayref v0.3.9
2026-08-18T01:00:15.0771144Z    Compiling sha1_smol v1.0.1
2026-08-18T01:00:15.2469566Z    Compiling smol_str v0.1.24
2026-08-18T01:00:15.7690370Z    Compiling toml_edit v0.22.27
2026-08-18T01:00:15.8743652Z    Compiling schemars_derive v1.2.1
2026-08-18T01:00:16.3350886Z    Compiling iroh-dns v0.98.0
2026-08-18T01:00:16.8548984Z    Compiling serial-windows v0.4.0
2026-08-18T01:00:17.0650130Z    Compiling igd-next v0.17.1
2026-08-18T01:00:19.5061683Z    Compiling lru v0.16.4
2026-08-18T01:00:19.5654654Z    Compiling hmac v0.12.1
2026-08-18T01:00:19.6421287Z    Compiling webpki-roots v1.0.7
2026-08-18T01:00:19.6841444Z    Compiling darling_core v0.23.0
2026-08-18T01:00:19.7290855Z    Compiling seize v0.5.1
2026-08-18T01:00:20.1429533Z    Compiling iroh v0.98.2
2026-08-18T01:00:20.3733275Z    Compiling serde_bytes v0.11.19
2026-08-18T01:00:20.5812188Z    Compiling once_cell_polyfill v1.70.2
2026-08-18T01:00:20.6671558Z    Compiling pin-utils v0.1.0
2026-08-18T01:00:20.7814664Z    Compiling dyn-clone v1.0.20
2026-08-18T01:00:20.8860872Z    Compiling bitflags v1.3.2
2026-08-18T01:00:20.9422204Z    Compiling anstyle v1.0.14
2026-08-18T01:00:20.9542288Z    Compiling lazy_static v1.5.0
2026-08-18T01:00:21.0559684Z    Compiling cmov v0.5.4
2026-08-18T01:00:21.1682287Z    Compiling anstyle-wincon v3.0.11
2026-08-18T01:00:21.3030954Z    Compiling ctutils v0.4.2
2026-08-18T01:00:21.4121535Z    Compiling shared_library v0.1.9
2026-08-18T01:00:21.5729750Z    Compiling nix v0.25.1
2026-08-18T01:00:21.6146279Z    Compiling schemars v1.2.1
2026-08-18T01:00:21.7025165Z    Compiling papaya v0.2.4
2026-08-18T01:00:22.0993314Z    Compiling hkdf v0.12.4
2026-08-18T01:00:22.2318628Z    Compiling portmapper v0.16.0
2026-08-18T01:00:22.2643755Z    Compiling darling_macro v0.23.0
2026-08-18T01:00:22.5659116Z    Compiling toml v0.8.23
2026-08-18T01:00:23.3433252Z    Compiling serial v0.4.0
2026-08-18T01:00:23.4111048Z    Compiling filedescriptor v0.8.3
2026-08-18T01:00:23.6645313Z    Compiling swarm-discovery v0.6.0-alpha.2 (https://github.com/SaberMage/swarm-discovery?rev=89a2200d54a4e3cab2f46cc75ebff49a1fb07614#89a2200d)
2026-08-18T01:00:24.0164297Z    Compiling anstyle-parse v1.0.0
2026-08-18T01:00:24.1646558Z    Compiling backon v1.6.0
2026-08-18T01:00:24.4891227Z    Compiling anstyle-query v1.1.5
2026-08-18T01:00:24.6178299Z    Compiling vte_generate_state_changes v0.1.2
2026-08-18T01:00:24.8280430Z    Compiling is_terminal_polyfill v1.70.2
2026-08-18T01:00:24.8995258Z    Compiling instability v0.3.12
2026-08-18T01:00:25.0507847Z    Compiling downcast-rs v1.2.1
2026-08-18T01:00:25.1366535Z    Compiling shell-words v1.1.1
2026-08-18T01:00:25.3125649Z    Compiling foldhash v0.1.5
2026-08-18T01:00:25.4883492Z    Compiling paste v1.0.15
2026-08-18T01:00:25.6996179Z    Compiling colorchoice v1.0.5
2026-08-18T01:00:25.7944026Z    Compiling unicode-width v0.2.0
2026-08-18T01:00:26.0841361Z    Compiling anstream v1.0.0
2026-08-18T01:00:26.2625916Z    Compiling hashbrown v0.15.5
2026-08-18T01:00:26.4863173Z    Compiling portable-pty v0.8.1
2026-08-18T01:00:26.8089189Z    Compiling vte v0.13.1
2026-08-18T01:00:27.3026059Z    Compiling spt-runtime v0.55.0 (C:\actions-runner\_work\spt-bs-core\spt-bs-core\crates\spt-runtime)
2026-08-18T01:00:27.4439577Z    Compiling darling v0.23.0
2026-08-18T01:00:27.4829257Z    Compiling spake2 v0.4.0
2026-08-18T01:00:27.6337119Z    Compiling itertools v0.13.0
2026-08-18T01:00:27.7491726Z    Compiling crossterm_winapi v0.9.1
2026-08-18T01:00:28.1265043Z    Compiling strum_macros v0.26.4
2026-08-18T01:00:28.9908625Z    Compiling sha1 v0.10.6
2026-08-18T01:00:29.1815847Z    Compiling castaway v0.2.4
2026-08-18T01:00:29.2904335Z    Compiling terminal_size v0.4.4
2026-08-18T01:00:29.4030362Z    Compiling static_assertions v1.1.0
2026-08-18T01:00:29.5453881Z    Compiling indoc v2.0.7
2026-08-18T01:00:29.5981891Z    Compiling recvmsg v1.0.0
2026-08-18T01:00:29.8703484Z    Compiling clap_lex v1.1.0
2026-08-18T01:00:30.0308218Z    Compiling doctest-file v1.1.1
2026-08-18T01:00:30.1025144Z    Compiling unicode-width v0.1.14
2026-08-18T01:00:30.3977512Z    Compiling interprocess v2.4.2
2026-08-18T01:00:30.4061530Z    Compiling unicode-truncate v1.1.0
2026-08-18T01:00:30.5625700Z    Compiling clap_builder v4.6.0
2026-08-18T01:00:32.6268888Z    Compiling compact_str v0.8.2
2026-08-18T01:00:33.2872360Z    Compiling strum v0.26.3
2026-08-18T01:00:33.5153177Z    Compiling spt-live v0.55.0 (C:\actions-runner\_work\spt-bs-core\spt-bs-core\crates\spt-live)
2026-08-18T01:00:34.5677081Z    Compiling crossterm v0.28.1
2026-08-18T01:00:34.9877036Z    Compiling spt-term v0.55.0 (C:\actions-runner\_work\spt-bs-core\spt-bs-core\crates\spt-term)
2026-08-18T01:00:35.3499374Z    Compiling lru v0.12.5
2026-08-18T01:00:35.8321239Z    Compiling clap_derive v4.6.1
2026-08-18T01:00:35.8676235Z    Compiling error-code v3.3.2
2026-08-18T01:00:36.0053584Z    Compiling cassowary v0.3.0
2026-08-18T01:00:36.6173339Z    Compiling ratatui v0.29.0
2026-08-18T01:00:37.2563353Z    Compiling clap v4.6.1
2026-08-18T01:00:37.4523622Z    Compiling clipboard-win v5.4.1
2026-08-18T01:00:37.4726433Z    Compiling nucleo-matcher v0.3.1
2026-08-18T01:00:37.8151814Z    Compiling qrcode v0.14.1
2026-08-18T01:00:46.3306891Z    Compiling rustls-webpki v0.103.13
2026-08-18T01:00:49.8424314Z    Compiling tokio-rustls v0.26.4
2026-08-18T01:00:49.8424726Z    Compiling noq-proto v0.17.0
2026-08-18T01:00:49.8425024Z    Compiling rustls-platform-verifier v0.7.0
2026-08-18T01:00:50.1051921Z    Compiling hickory-net v0.26.0-beta.4
2026-08-18T01:00:50.2268273Z    Compiling hyper-rustls v0.27.9
2026-08-18T01:00:50.5268628Z    Compiling reqwest v0.13.4
2026-08-18T01:00:52.2937507Z    Compiling hickory-resolver v0.26.0-beta.4
2026-08-18T01:00:55.8378190Z    Compiling tokio-websockets v0.13.2
2026-08-18T01:01:14.4909086Z    Compiling spt-net v0.55.0 (C:\actions-runner\_work\spt-bs-core\spt-bs-core\crates\spt-net)
2026-08-18T01:01:16.5956457Z    Compiling spt-daemon v0.55.0 (C:\actions-runner\_work\spt-bs-core\spt-bs-core\crates\spt-daemon)
2026-08-18T01:01:33.8828474Z    Compiling spt v0.55.0 (C:\actions-runner\_work\spt-bs-core\spt-bs-core\crates\spt)
2026-08-18T01:01:34.2080174Z     Finished `dev` profile [unoptimized + debuginfo] target(s) in 2m 36s
2026-08-18T01:01:34.3217028Z ##[group]Run cargo nextest run --workspace -E 'kind(lib) + kind(bin)'
2026-08-18T01:01:34.3217533Z [36;1mcargo nextest run --workspace -E 'kind(lib) + kind(bin)'[0m
2026-08-18T01:01:34.3223523Z shell: C:\Program Files\PowerShell\7\pwsh.EXE -command ". '{0}'"
2026-08-18T01:01:34.3223739Z ##[endgroup]
2026-08-18T01:01:36.0714929Z    Compiling fastrand v2.4.1
2026-08-18T01:01:36.0738889Z    Compiling spt-poolguard v0.55.0 (C:\actions-runner\_work\spt-bs-core\spt-bs-core\crates\spt-poolguard)
2026-08-18T01:01:36.1328700Z    Compiling bytemuck v1.25.2
2026-08-18T01:01:36.1329207Z    Compiling mock-adapter v0.55.0 (C:\actions-runner\_work\spt-bs-core\spt-bs-core\adapters\mock)
2026-08-18T01:01:36.2403702Z    Compiling tempfile v3.27.0
2026-08-18T01:01:36.3801913Z    Compiling futures-lite v2.6.1
2026-08-18T01:01:36.6854004Z    Compiling backon v1.6.0
2026-08-18T01:01:36.7546495Z    Compiling spt-test-support v0.55.0 (C:\actions-runner\_work\spt-bs-core\spt-bs-core\crates\spt-test-support)
2026-08-18T01:01:36.8848648Z    Compiling n0-future v0.3.2
2026-08-18T01:01:36.9519297Z    Compiling rgb v0.8.53
2026-08-18T01:01:36.9955872Z    Compiling n0-watcher v0.6.1
2026-08-18T01:01:37.0172739Z    Compiling spt-store v0.55.0 (C:\actions-runner\_work\spt-bs-core\spt-bs-core\crates\spt-store)
2026-08-18T01:01:37.0341254Z    Compiling iroh-dns v0.98.0
2026-08-18T01:01:37.1698159Z    Compiling netwatch v0.16.0
2026-08-18T01:01:37.3572306Z    Compiling avt v0.18.0
2026-08-18T01:01:37.4170066Z    Compiling iroh-relay v0.98.0
2026-08-18T01:01:38.4517638Z    Compiling portmapper v0.16.0
2026-08-18T01:01:42.4649096Z    Compiling spt-msg v0.55.0 (C:\actions-runner\_work\spt-bs-core\spt-bs-core\crates\spt-msg)
2026-08-18T01:01:43.2332238Z    Compiling spt-term v0.55.0 (C:\actions-runner\_work\spt-bs-core\spt-bs-core\crates\spt-term)
2026-08-18T01:01:45.6367185Z    Compiling spt-runtime v0.55.0 (C:\actions-runner\_work\spt-bs-core\spt-bs-core\crates\spt-runtime)
2026-08-18T01:01:45.6787412Z    Compiling iroh v0.98.2
2026-08-18T01:01:49.8117194Z    Compiling spt-live v0.55.0 (C:\actions-runner\_work\spt-bs-core\spt-bs-core\crates\spt-live)
2026-08-18T01:02:00.9544450Z    Compiling spt-proto v0.55.0 (C:\actions-runner\_work\spt-bs-core\spt-bs-core\crates\spt-proto)
2026-08-18T01:02:01.0446121Z    Compiling spt-procident v0.55.0 (C:\actions-runner\_work\spt-bs-core\spt-bs-core\crates\spt-procident)
2026-08-18T01:02:06.0599785Z    Compiling spt-net v0.55.0 (C:\actions-runner\_work\spt-bs-core\spt-bs-core\crates\spt-net)
2026-08-18T01:02:07.9825974Z    Compiling spt-daemon v0.55.0 (C:\actions-runner\_work\spt-bs-core\spt-bs-core\crates\spt-daemon)
2026-08-18T01:02:29.6872910Z    Compiling spt v0.55.0 (C:\actions-runner\_work\spt-bs-core\spt-bs-core\crates\spt)
2026-08-18T01:02:35.0276478Z    Compiling xtask v0.55.0 (C:\actions-runner\_work\spt-bs-core\spt-bs-core\crates\xtask)
2026-08-18T01:05:12.8437193Z     Finished `test` profile [unoptimized + debuginfo] target(s) in 3m 37s
2026-08-18T01:05:19.5303410Z ────────────
2026-08-18T01:05:19.5303687Z  Nextest run ID cd13d6ef-5b3b-4ec8-9d02-2e107a93d947 with nextest profile: default
2026-08-18T01:05:19.5304029Z     Starting 2567 tests across 24 binaries (1 test and 167 binaries skipped)
2026-08-18T01:05:19.5631979Z         PASS [   0.024s] (   1/2567) spt::bin/spt api::auth::tests::an_unverifiable_live_owner_never_grants_a_repin
2026-08-18T01:05:19.5662752Z         PASS [   0.029s] (   2/2567) mock-adapter::bin/capture-player tests::parses_a_well_formed_record
2026-08-18T01:05:19.5847749Z         PASS [   0.047s] (   3/2567) spt::bin/spt accessview::tests::node_roster_lists_node_scope_entities_and_mode_exceptions
2026-08-18T01:05:19.5849476Z         PASS [   0.047s] (   4/2567) spt::bin/spt api::auth::tests::live_owner_mismatch_still_refuses
2026-08-18T01:05:19.5859901Z         PASS [   0.048s] (   5/2567) spt::bin/spt api::auth::tests::no_proof_is_refused
2026-08-18T01:05:19.5903626Z         PASS [   0.053s] (   6/2567) spt::bin/spt accessview::tests::target_roster_groups_types_and_counts_rules
2026-08-18T01:05:19.5996088Z         PASS [   0.062s] (   7/2567) spt::bin/spt api::auth::tests::mints_distinct_nonempty_tokens
2026-08-18T01:05:19.6015460Z         PASS [   0.064s] (   8/2567) spt::bin/spt api::auth::tests::dead_owner_repin_refused_when_sid_is_a_psyche_custody_sid
2026-08-18T01:05:19.6069778Z         PASS [   0.069s] (   9/2567) spt::bin/spt accessview::tests::drill_matches_only_its_own_kind
2026-08-18T01:05:19.6074132Z         PASS [   0.070s] (  10/2567) mock-adapter::bin/capture-player tests::refuses_a_length_mismatch
2026-08-18T01:05:19.6170208Z         PASS [   0.079s] (  11/2567) spt::bin/spt api::auth::tests::dead_owner_repin_refused_when_sid_owns_another_perch
2026-08-18T01:05:19.6199080Z         PASS [   0.082s] (  12/2567) spt::bin/spt api::auth::tests::missing_endpoint_is_no_endpoint
2026-08-18T01:05:19.6232366Z         PASS [   0.086s] (  13/2567) spt::bin/spt accessview::tests::a_pinned_open_renders_apart_from_a_default_open
2026-08-18T01:05:19.6245762Z         PASS [   0.087s] (  14/2567) spt::bin/spt api::auth::tests::a_recycled_owner_pid_no_longer_blocks_the_dead_owner_rescue
2026-08-18T01:05:19.6469869Z         PASS [   0.062s] (  15/2567) spt::bin/spt api::auth::tests::worker_missing_is_no_endpoint
2026-08-18T01:05:19.6624330Z         PASS [   0.125s] (  16/2567) spt::bin/spt api::auth::tests::dead_owner_repin_still_rescues_a_non_custody_sid
2026-08-18T01:05:19.6851270Z         PASS [   0.118s] (  17/2567) spt::bin/spt api::auth::tests::token_auth_path_unchanged
2026-08-18T01:05:19.6859281Z         PASS [   0.123s] (  18/2567) spt::bin/spt api::auth::tests::session_id_proof_authenticates
2026-08-18T01:05:19.6862640Z         PASS [   0.101s] (  19/2567) spt::bin/spt api::auth::tests::token_proof_authenticates
2026-08-18T01:05:19.6993860Z         PASS [   0.109s] (  20/2567) spt::bin/spt api::auth::tests::worker_stored_sid_authenticates
2026-08-18T01:05:19.6994578Z         PASS [   0.113s] (  21/2567) spt::bin/spt api::auth::tests::worker_parent_current_sid_authenticates_after_rotation
2026-08-18T01:05:19.7001532Z         PASS [   0.162s] (  22/2567) spt::bin/spt api::auth::tests::pinned_to_dead_sid_mismatched_poll_repins
2026-08-18T01:05:19.7135067Z         PASS [   0.114s] (  23/2567) spt::bin/spt api::auth::tests::worker_wrong_sid_and_token_only_refused
2026-08-18T01:05:19.7281770Z         PASS [   0.103s] (  24/2567) spt::bin/spt api::delivery::tests::inject_all_pty_falls_back_to_hook
2026-08-18T01:05:19.7284462Z         PASS [   0.121s] (  25/2567) spt::bin/spt api::delivery::tests::echo_gate_explicit_toggle
2026-08-18T01:05:19.7367910Z         PASS [   0.119s] (  26/2567) spt::bin/spt api::delivery::tests::idle_busy_transitions_manage_sentinels
2026-08-18T01:05:19.7387948Z         PASS [   0.115s] (  27/2567) spt::bin/spt api::delivery::tests::idle_no_gate_does_not_arm_gate
2026-08-18T01:05:19.7423820Z         PASS [   0.141s] (  28/2567) spt::bin/spt api::auth::tests::wrong_token_and_wrong_session_refused
2026-08-18T01:05:19.7426612Z         PASS [   0.096s] (  29/2567) spt::bin/spt api::delivery::tests::inject_resolution_drops_pty_defaults_hook
2026-08-18T01:05:19.7428498Z         PASS [   0.136s] (  30/2567) spt::bin/spt api::delivery::tests::an_undated_state_is_dated_by_a_non_edge_report
2026-08-18T01:05:19.8240335Z         PASS [   0.110s] (  31/2567) spt::bin/spt api::engineroom::tests::a_pin_is_not_a_clear
2026-08-18T01:05:19.8277441Z         PASS [   0.100s] (  32/2567) spt::bin/spt api::engineroom::tests::a_refresh_adopts_only_a_real_divergence
2026-08-18T01:05:19.8337724Z         PASS [   0.105s] (  33/2567) spt::bin/spt api::engineroom::tests::an_admin_code_verifies_across_the_ceremony_window_only
2026-08-18T01:05:19.8366025Z         PASS [   0.100s] (  34/2567) spt::bin/spt api::engineroom::tests::subnet_authority_is_the_empowerment_not_the_gate
2026-08-18T01:05:19.8411233Z         PASS [   0.102s] (  35/2567) spt::bin/spt api::engineroom::tests::the_gate_admits_only_the_reserved_id_provisioned_and_authenticated
2026-08-18T01:05:19.8441565Z         PASS [   0.102s] (  36/2567) spt::bin/spt api::engineroom::tests::the_perch_minting_verbs_admit_the_reserved_id_only_as_a_completion
2026-08-18T01:05:19.8568061Z         PASS [   0.033s] (  37/2567) spt::bin/spt api::engineroom::tests::the_unset_echo_names_what_governs_next
2026-08-18T01:05:19.8618346Z         PASS [   0.034s] (  38/2567) spt::bin/spt api::engineroom::tests::the_written_node_mode_is_the_one_the_chain_reads
2026-08-18T01:05:19.8866659Z         PASS [   0.224s] (  39/2567) spt::bin/spt api::delivery::tests::only_a_real_state_edge_stamps_the_transition_instant
2026-08-18T01:05:19.8908662Z         PASS [   0.148s] (  40/2567) spt::bin/spt api::engineroom::tests::the_surface_mode_verb_refuses_a_caller_that_is_not_the_engine_room
2026-08-18T01:05:19.8978413Z         PASS [   0.041s] (  41/2567) spt::bin/spt api::reporting::tests::boundary_missing_perch_refused
2026-08-18T01:05:19.9286665Z         PASS [   0.186s] (  42/2567) spt::bin/spt api::engineroom::tests::the_surface_mode_verb_refuses_an_unminted_surface_and_writes_nothing
2026-08-18T01:05:19.9395270Z         PASS [   0.011s] (  43/2567) spt::bin/spt api::reporting::tests::capability_lists_hostable_types
2026-08-18T01:05:20.0412104Z         PASS [   0.152s] (  44/2567) spt::bin/spt api::reporting::tests::boundary_refuses_rotating_onto_a_psyche_custody_sid
2026-08-18T01:05:20.0436385Z         PASS [   0.423s] (  45/2567) spt::bin/spt api::delivery::tests::idle_drain_peek_returns_non_deferred_rows_only
2026-08-18T01:05:20.0776055Z         PASS [   0.138s] (  46/2567) spt::bin/spt api::reporting::tests::digest_entry_validates_and_appends_to_digest_log
2026-08-18T01:05:20.0975927Z         PASS [   0.020s] (  47/2567) spt::bin/spt api::reporting::tests::endpoint_info_attached_node_from_honest_stamps
2026-08-18T01:05:20.1044761Z         PASS [   0.405s] (  48/2567) spt::bin/spt api::delivery::tests::poll_only_drains_when_hook_method_present
2026-08-18T01:05:20.1119585Z         PASS [   0.014s] (  49/2567) spt::bin/spt api::reporting::tests::endpoint_info_attached_node_self_attributes_own_node_driver
2026-08-18T01:05:20.1175715Z         PASS [   0.013s] (  50/2567) spt::bin/spt api::reporting::tests::endpoint_info_json_always_carries_an_activity_word
2026-08-18T01:05:20.1300155Z         PASS [   0.012s] (  51/2567) spt::bin/spt api::reporting::tests::env_aliases_resolved_from_manifest
2026-08-18T01:05:20.1863907Z         PASS [   0.147s] (  52/2567) spt::bin/spt api::reporting::tests::driven_by_reads_daemon_marker
2026-08-18T01:05:20.2008816Z         PASS [   0.014s] (  53/2567) spt::bin/spt api::reporting::tests::filedrops_are_fixed_named_files
2026-08-18T01:05:20.2150678Z         PASS [   0.103s] (  54/2567) spt::bin/spt api::reporting::tests::endpoint_info_reports_and_refuses
2026-08-18T01:05:20.2161674Z         PASS [   0.173s] (  55/2567) spt::bin/spt api::reporting::tests::endpoint_info_activity_word_tracks_the_idle_sentinel
2026-08-18T01:05:20.2262655Z         PASS [   0.390s] (  56/2567) spt::bin/spt api::reporting::tests::a_rotated_away_session_id_cannot_resurrect_a_dropped_empowerment
2026-08-18T01:05:20.2461239Z         PASS [   0.547s] (  57/2567) spt::bin/spt api::delivery::tests::poll_drains_non_deferred_by_default
2026-08-18T01:05:20.2799001Z         PASS [   0.417s] (  58/2567) spt::bin/spt api::reporting::tests::boundary_rebinds_keeping_anchor
2026-08-18T01:05:20.2838178Z         PASS [   0.450s] (  59/2567) spt::bin/spt api::reporting::tests::a_non_engine_room_boundary_never_moves_the_seats_empowerment
2026-08-18T01:05:20.2855094Z         PASS [   0.388s] (  60/2567) spt::bin/spt api::reporting::tests::boundary_with_a_fresh_sid_is_unaffected_by_the_squat_guard
2026-08-18T01:05:20.3049312Z         PASS [   0.090s] (  61/2567) spt::bin/spt api::reporting::tests::history_log_appends
2026-08-18T01:05:20.7084439Z         PASS [   1.023s] (  62/2567) spt::bin/spt api::delivery::tests::poll_drain_holds_deferred_while_resting_and_releases_once_on_wake
2026-08-18T01:05:20.7179158Z         PASS [   0.517s] (  63/2567) spt::bin/spt api::reporting::tests::hint_once_per_session_one_per_message
2026-08-18T01:05:20.7183832Z         PASS [   0.492s] (  64/2567) spt::bin/spt api::reporting::tests::presence_records_endpoint
2026-08-18T01:05:20.7184688Z         PASS [   0.877s] (  65/2567) spt::bin/spt api::reporting::tests::boundary_appends_to_the_session_ledger
2026-08-18T01:05:20.7211425Z         PASS [   0.505s] (  66/2567) spt::bin/spt api::reporting::tests::misplaced_drop_is_still_found_once_the_anchor_is_correct
2026-08-18T01:05:20.7219137Z         PASS [   0.591s] (  67/2567) spt::bin/spt api::reporting::tests::erase_unregisters_regardless_of_liveness
2026-08-18T01:05:20.7337025Z         PASS [   1.033s] (  68/2567) spt::bin/spt api::engineroom::tests::a_non_engine_room_attempt_never_touches_the_empower_ledger
2026-08-18T01:05:20.7507468Z         PASS [   1.064s] (  69/2567) spt::bin/spt api::delivery::tests::poll_drain_suppresses_idle_only_which_reaches_the_relay
2026-08-18T01:05:20.7901067Z         PASS [   1.103s] (  70/2567) spt::bin/spt api::delivery::tests::poll_drain_validates_notify_copies_against_their_rows
2026-08-18T01:05:20.8250978Z         PASS [   0.107s] (  71/2567) spt::bin/spt api::startup::tests::a_dead_binder_pid_proves_nothing_and_never_drops_the_stamp
2026-08-18T01:05:20.8350679Z         PASS [   0.117s] (  72/2567) spt::bin/spt api::tests::adapter_is_optional
2026-08-18T01:05:20.8495205Z         PASS [   0.128s] (  73/2567) spt::bin/spt api::tests::ctx_manifest_unregistered_no_manifest_is_none_not_fatal
2026-08-18T01:05:20.8629362Z         PASS [   0.579s] (  74/2567) spt::bin/spt api::reporting::tests::session_end_erase_wipes_childless_perch
2026-08-18T01:05:20.8647293Z         PASS [   0.579s] (  75/2567) spt::bin/spt api::reporting::tests::session_end_soft_preserves_state
2026-08-18T01:05:20.8650024Z         PASS [   0.146s] (  76/2567) spt::bin/spt api::tests::ctx_manifest_override_wins_when_manifest_present
2026-08-18T01:05:20.8747019Z         PASS [   0.125s] (  77/2567) spt::bin/spt api::tests::state_value_is_validated
2026-08-18T01:05:20.8792368Z         PASS [   0.145s] (  78/2567) spt::bin/spt api::tests::load_manifest_resolves_composite_adapter_option
2026-08-18T01:05:20.8822014Z         PASS [   0.161s] (  79/2567) spt::bin/spt api::tests::ctx_manifest_resolves_from_registry_when_manifest_absent
2026-08-18T01:05:20.8857807Z         PASS [   0.061s] (  80/2567) spt::bin/spt api::startup::tests::a_dead_relays_capability_stamp_is_not_resurrected_by_a_listener_rebind
2026-08-18T01:05:20.8888429Z         PASS [   0.099s] (  81/2567) spt::bin/spt api::tests::surface_parses
2026-08-18T01:05:20.9314898Z         PASS [   0.049s] (  82/2567) spt::bin/spt cli::lifecycle_verb_decisions::remembered_defaults_prefer_the_newest_row_field_by_field
2026-08-18T01:05:20.9404439Z         PASS [   0.052s] (  83/2567) spt::bin/spt cli::lifecycle_verb_decisions::the_adapter_precedence_is_flag_then_endpoint_then_a_sole_installed_one
2026-08-18T01:05:20.9445841Z         PASS [   0.013s] (  84/2567) spt::bin/spt cli::lifecycle_verb_decisions::the_go_ladder_takes_the_ratified_rung
2026-08-18T01:05:20.9987455Z         PASS [   0.058s] (  85/2567) spt::bin/spt cli::reserved_id_tests::endpoint_run_refuses_the_reserved_id_and_saves_nothing
2026-08-18T01:05:21.0037881Z         PASS [   0.724s] (  86/2567) spt::bin/spt api::reporting::tests::session_end_erase_refused_with_live_children
2026-08-18T01:05:21.0137208Z         PASS [   0.708s] (  87/2567) spt::bin/spt api::reporting::tests::soft_end_preserves_a_live_listeners_address
2026-08-18T01:05:21.0238460Z         PASS [   1.133s] (  88/2567) spt::bin/spt api::reporting::tests::boundary_resurfaces_undismissed_notifs
2026-08-18T01:05:21.0274717Z         PASS [   0.781s] (  89/2567) spt::bin/spt api::reporting::tests::session_end_erase_reaps_stale_worker_then_proceeds
2026-08-18T01:05:21.0339331Z         PASS [   0.199s] (  90/2567) spt::bin/spt api::worker::tests::cascade_guard_tracks_live_children
2026-08-18T01:05:21.0340048Z         PASS [   0.155s] (  91/2567) spt::bin/spt api::worker::tests::worker_start_registration_sid_falls_back_to_presented
2026-08-18T01:05:21.0368625Z         PASS [   0.329s] (  92/2567) spt::bin/spt api::reporting::tests::soft_end_still_cleans_a_dead_listeners_address
2026-08-18T01:05:21.0384089Z         PASS [   0.163s] (  93/2567) spt::bin/spt api::worker::tests::worker_start_nests_under_parent
2026-08-18T01:05:21.0384756Z         PASS [   1.194s] (  94/2567) spt::bin/spt api::reporting::tests::boundary_injects_deferred_shell_context
2026-08-18T01:05:21.0636163Z         PASS [   0.060s] (  95/2567) spt::bin/spt cli::resume_resolution_tests::resume_never_feeds_a_provisional
2026-08-18T01:05:21.0656446Z         PASS [   0.216s] (  96/2567) spt::bin/spt api::worker::tests::guard_clears_only_when_all_children_stopped
2026-08-18T01:05:21.0686332Z         PASS [   0.055s] (  97/2567) spt::bin/spt cli::retired_verb_pre_scan::the_pre_scan_reads_the_verb_position_only
2026-08-18T01:05:21.0798881Z         PASS [   0.056s] (  98/2567) spt::bin/spt cli::retired_verb_pre_scan::the_retired_verb_refuses_with_a_pointer_a_generic_error_cannot_fake
2026-08-18T01:05:21.0812118Z         PASS [   0.082s] (  99/2567) spt::bin/spt cli::reserved_id_tests::the_lifecycle_verbs_refuse_their_preconditions
2026-08-18T01:05:21.0905482Z         PASS [   0.063s] ( 100/2567) spt::bin/spt cli::run_home_tests::order_by_mru_orders_guidance
2026-08-18T01:05:21.0922211Z         PASS [   0.227s] ( 101/2567) spt::bin/spt api::worker::tests::worker_start_mints_id_stores_parent_sid_and_metadata
2026-08-18T01:05:21.0938762Z         PASS [   0.060s] ( 102/2567) spt::bin/spt cli::run_home_tests::run_home_resolution_matrix
2026-08-18T01:05:21.1481037Z         PASS [   0.114s] ( 103/2567) spt::bin/spt cli::run_on_live_tests::run_on_live_never_duplicates_and_create_conflicts
2026-08-18T01:05:21.1735240Z         PASS [   0.135s] ( 104/2567) spt::bin/spt cli::tests::a_mint_captures_its_declared_mode_and_nothing_else
2026-08-18T01:05:21.1810566Z         PASS [   0.115s] ( 105/2567) spt::bin/spt cli::tests::a_notfound_lands_locally_only_when_the_target_is_an_endpoint_here
2026-08-18T01:05:21.1923539Z         PASS [   0.124s] ( 106/2567) spt::bin/spt cli::tests::a_one_way_approval_hands_over_a_reverse_command_that_parses
2026-08-18T01:05:21.2030210Z         PASS [   0.122s] ( 107/2567) spt::bin/spt cli::tests::a_remote_send_receive_claims_only_what_it_can_deliver
2026-08-18T01:05:21.2076995Z         PASS [   0.117s] ( 108/2567) spt::bin/spt cli::tests::a_reply_carried_request_is_not_stamped_as_a_first_order_knock
2026-08-18T01:05:21.2148682Z         PASS [   0.122s] ( 109/2567) spt::bin/spt cli::tests::a_retired_flag_names_what_replaced_it
2026-08-18T01:05:21.2287461Z         PASS [   0.135s] ( 110/2567) spt::bin/spt cli::tests::a_row_without_a_node_says_so_and_one_with_a_node_shows_it
2026-08-18T01:05:21.2458137Z         PASS [   0.098s] ( 111/2567) spt::bin/spt cli::tests::a_rule_describes_itself_in_plain_words
2026-08-18T01:05:21.2496393Z         PASS [   0.211s] ( 112/2567) spt::bin/spt cli::tests::a_minted_sealed_code_is_the_one_that_opens_to_its_record
2026-08-18T01:05:21.2502082Z         PASS [   0.214s] ( 113/2567) spt::bin/spt cli::tests::a_local_hit_never_asks_the_broker
2026-08-18T01:05:21.2621276Z         PASS [   0.081s] ( 114/2567) spt::bin/spt cli::tests::a_sender_rule_on_a_non_attributable_surface_is_refused
2026-08-18T01:05:21.2622450Z         PASS [   0.089s] ( 115/2567) spt::bin/spt cli::tests::a_sealed_codes_subnet_is_chosen_and_never_guessed
2026-08-18T01:05:21.2641540Z         PASS [   0.200s] ( 116/2567) spt::bin/spt cli::tests::a_non_attributable_bake_needs_the_acknowledgment_and_keeps_it
2026-08-18T01:05:21.2761644Z         PASS [   0.084s] ( 117/2567) spt::bin/spt cli::tests::a_status_row_reads_held_over_running_and_carries_its_evidence
2026-08-18T01:05:21.2808569Z         PASS [   0.076s] ( 118/2567) spt::bin/spt cli::tests::a_subcommand_name_beats_the_bare_target
2026-08-18T01:05:21.2828523Z         PASS [   0.418s] ( 119/2567) spt::bin/spt api::worker::tests::worker_poll_holds_deferred_while_resting
2026-08-18T01:05:21.2936039Z         PASS [   0.085s] ( 120/2567) spt::bin/spt cli::tests::a_subnet_fork_grant_names_the_members_that_cannot_resolve
2026-08-18T01:05:21.3126098Z         PASS [   0.067s] ( 121/2567) spt::bin/spt cli::tests::adapter_add_transport_flags_parse
2026-08-18T01:05:21.3193490Z         PASS [   0.091s] ( 122/2567) spt::bin/spt cli::tests::access_subcommands_parse
2026-08-18T01:05:21.3383787Z         PASS [   0.476s] ( 123/2567) spt::bin/spt api::worker::tests::worker_poll_drains_spool
2026-08-18T01:05:21.3840584Z         PASS [   0.120s] ( 124/2567) spt::bin/spt cli::tests::adapter_name_validation_flags_every_unknown
2026-08-18T01:05:21.4008531Z         PASS [   0.515s] ( 125/2567) spt::bin/spt api::startup::tests::a_listener_over_a_dead_pty_is_not_offlined_by_the_liveness_reconcile
2026-08-18T01:05:21.4011184Z         PASS [   0.125s] ( 126/2567) spt::bin/spt cli::tests::adapter_names_comma_list_parses_and_refuses_empties
2026-08-18T01:05:21.4064098Z         PASS [   0.144s] ( 127/2567) spt::bin/spt cli::tests::adapter_has_live_endpoint_detects_matching_live_perch
2026-08-18T01:05:21.4284576Z         PASS [   0.109s] ( 128/2567) spt::bin/spt cli::tests::adapter_translate_proof_parses
2026-08-18T01:05:21.4364309Z         PASS [   0.143s] ( 129/2567) spt::bin/spt cli::tests::adapter_subcommands_parse
2026-08-18T01:05:21.4516418Z         PASS [   0.168s] ( 130/2567) spt::bin/spt cli::tests::adapter_string_verbs
2026-08-18T01:05:21.4517573Z         PASS [   0.188s] ( 131/2567) spt::bin/spt cli::tests::adapter_has_live_endpoint_false_for_other_or_dead
2026-08-18T01:05:21.4522482Z         PASS [   0.171s] ( 132/2567) spt::bin/spt cli::tests::adapter_profile_verbs_local_only
2026-08-18T01:05:21.4565000Z         PASS [   0.242s] ( 133/2567) spt::bin/spt cli::tests::a_wedged_probe_costs_one_ceiling_and_reads_unknown_not_offline
2026-08-18T01:05:21.4615576Z         PASS [   0.077s] ( 134/2567) spt::bin/spt cli::tests::adapter_update_notice_absent_when_no_message
2026-08-18T01:05:21.4650572Z         PASS [   0.127s] ( 135/2567) spt::bin/spt cli::tests::adapter_update_install_dir_is_registered_source_dir_not_repo_name
2026-08-18T01:05:21.4675602Z         PASS [   0.067s] ( 136/2567) spt::bin/spt cli::tests::adapter_update_notice_renders_declared_message_markdown
2026-08-18T01:05:21.5055317Z         PASS [   0.105s] ( 137/2567) spt::bin/spt api::startup::tests::a_live_owner_whose_birth_matches_still_refuses_the_bind
2026-08-18T01:05:21.5071636Z         PASS [   0.101s] ( 138/2567) spt::bin/spt cli::tests::adapter_update_summary_and_exit_aggregate_isolated_failures
2026-08-18T01:05:21.5213726Z         PASS [   0.085s] ( 139/2567) spt::bin/spt cli::tests::adapter_version_parses
2026-08-18T01:05:21.5432384Z         PASS [   0.092s] ( 140/2567) spt::bin/spt cli::tests::agent_ground_describes_itself_exactly_as_the_ceremony_always_did
2026-08-18T01:05:21.5466892Z         PASS [   0.118s] ( 141/2567) spt::bin/spt cli::tests::adapter_use_sets_and_clears_pointer
2026-08-18T01:05:21.5499171Z         PASS [   0.100s] ( 142/2567) spt::bin/spt cli::tests::adapter_version_surfaces_declared_adapter_version
2026-08-18T01:05:21.5514894Z         PASS [   0.100s] ( 143/2567) spt::bin/spt cli::tests::all_hidden_this_node_suppresses_no_perches_marker
2026-08-18T01:05:21.5641155Z         PASS [   0.108s] ( 144/2567) spt::bin/spt cli::tests::already_applied_message_reads_up_to_date_no_restart
2026-08-18T01:05:21.5661882Z         PASS [   0.101s] ( 145/2567) spt::bin/spt cli::tests::an_approval_binds_the_subject_the_knocks_origin_implies
2026-08-18T01:05:21.5733884Z         PASS [   0.112s] ( 146/2567) spt::bin/spt cli::tests::an_addressed_target_is_local_only_when_its_node_half_names_this_node
2026-08-18T01:05:21.5742640Z         PASS [   0.107s] ( 147/2567) spt::bin/spt cli::tests::an_empty_stored_surface_list_still_means_every_surface
2026-08-18T01:05:21.5774932Z         PASS [   0.070s] ( 148/2567) spt::bin/spt cli::tests::an_empty_unlisted_set_renders_no_heading_at_all
2026-08-18T01:05:21.6355089Z         PASS [   0.130s] ( 149/2567) spt::bin/spt api::startup::tests::a_recycled_owner_pid_no_longer_refuses_the_bind
2026-08-18T01:05:21.6391707Z         PASS [   0.096s] ( 150/2567) spt::bin/spt cli::tests::an_excluded_knock_is_neither_a_landing_nor_a_wire_refusal
2026-08-18T01:05:21.6446702Z         PASS [   0.098s] ( 151/2567) spt::bin/spt cli::tests::an_undelivered_receipt_reports_only_the_receipt
2026-08-18T01:05:21.6542802Z         PASS [   0.104s] ( 152/2567) spt::bin/spt cli::tests::answering_verbs_declare_no_directionality
2026-08-18T01:05:21.6564832Z         PASS [   0.407s] ( 153/2567) spt::bin/spt cli::tests::adapter_digest_proof_fills_session_id_key
2026-08-18T01:05:21.6630921Z         PASS [   0.112s] ( 154/2567) spt::bin/spt cli::tests::any_single_evidence_source_is_enough_and_only_nothing_refuses
2026-08-18T01:05:21.6690946Z         PASS [   0.105s] ( 155/2567) spt::bin/spt cli::tests::api_adapter_flag_is_group_level_not_post_subcommand
2026-08-18T01:05:21.6697525Z         PASS [   0.419s] ( 156/2567) spt::bin/spt cli::tests::adapter_digest_proof_gates_on_drops
2026-08-18T01:05:21.6715747Z         PASS [   0.105s] ( 157/2567) spt::bin/spt cli::tests::api_listen_accepts_session_id_flag
2026-08-18T01:05:21.6745112Z         PASS [   0.101s] ( 158/2567) spt::bin/spt cli::tests::applied_message_appends_restart_required_notice
2026-08-18T01:05:21.6805709Z         PASS [   0.106s] ( 159/2567) spt::bin/spt cli::tests::applied_message_renders_semver_or_counter_fallback_and_states_applied
2026-08-18T01:05:21.6996710Z         PASS [   0.755s] ( 160/2567) spt::bin/spt cli::reserved_id_tests::rename_into_the_reserved_id_is_refused
2026-08-18T01:05:21.7139799Z         PASS [   0.060s] ( 161/2567) spt::bin/spt cli::tests::bare_tty_guard
2026-08-18T01:05:21.7143594Z         PASS [   0.070s] ( 162/2567) spt::bin/spt cli::tests::bare_spt_parses_to_none
2026-08-18T01:05:21.7279723Z         PASS [   0.072s] ( 163/2567) spt::bin/spt cli::tests::bare_update_parses_composite_flags
2026-08-18T01:05:21.7364783Z         PASS [   0.097s] ( 164/2567) spt::bin/spt cli::tests::apply_user_msg_gate_local_origination
2026-08-18T01:05:21.7789747Z         PASS [   0.143s] ( 165/2567) spt::bin/spt api::startup::tests::a_recycled_relay_pid_is_fixed_too_so_the_role_gate_is_not_carrying_this
2026-08-18T01:05:21.7965919Z         PASS [   0.134s] ( 166/2567) spt::bin/spt cli::tests::both_knock_answer_surfaces_take_a_monic
2026-08-18T01:05:21.8106490Z         PASS [   0.141s] ( 167/2567) spt::bin/spt cli::tests::broker_image_line_reports_without_warning_or_remedy
2026-08-18T01:05:21.8128576Z         PASS [   0.141s] ( 168/2567) spt::bin/spt cli::tests::classify_flat_archive_never_misfires
2026-08-18T01:05:21.8171656Z         PASS [   0.148s] ( 169/2567) spt::bin/spt cli::tests::classify_fetch_reject_matrix
2026-08-18T01:05:21.8213319Z         PASS [   0.147s] ( 170/2567) spt::bin/spt cli::tests::classify_multiplatform_captures_only_known_triples
2026-08-18T01:05:21.8253225Z         PASS [   0.145s] ( 171/2567) spt::bin/spt cli::tests::cli_send_stamps_cli_at_node_origin
2026-08-18T01:05:21.8268939Z         PASS [   0.113s] ( 172/2567) spt::bin/spt cli::tests::connection_lines_net_less_hides_stale_heartbeat
2026-08-18T01:05:21.8296391Z         PASS [   0.130s] ( 173/2567) spt::bin/spt cli::tests::composite_plans_core_first_and_core_only_skips_adapters
2026-08-18T01:05:21.8725596Z         PASS [   0.158s] ( 174/2567) spt::bin/spt cli::tests::coordinator_image_line_is_the_only_stale_warning
2026-08-18T01:05:21.8784551Z         PASS [   0.150s] ( 175/2567) spt::bin/spt cli::tests::create_existing_name_is_usage_error
2026-08-18T01:05:21.8860372Z         PASS [   0.149s] ( 176/2567) spt::bin/spt cli::tests::create_mints_two_distinct_keys_and_records_the_mode
2026-08-18T01:05:21.8962808Z         PASS [   0.100s] ( 177/2567) spt::bin/spt cli::tests::create_mode_is_never_preselected
2026-08-18T01:05:21.9023292Z         PASS [   0.092s] ( 178/2567) spt::bin/spt cli::tests::create_new_existing_name_is_usage_error
2026-08-18T01:05:21.9094295Z         PASS [   0.332s] ( 179/2567) spt::bin/spt cli::tests::apply_release_crc_swap_only_swaps_changed
2026-08-18T01:05:21.9144328Z         PASS [   0.097s] ( 180/2567) spt::bin/spt cli::tests::create_not_elevated_refuses_without_saving
2026-08-18T01:05:21.9240421Z         PASS [   0.111s] ( 181/2567) spt::bin/spt cli::tests::create_new_mints_shows_and_requests_save
2026-08-18T01:05:21.9300229Z         PASS [   0.103s] ( 182/2567) spt::bin/spt cli::tests::cross_node_after_filters_a_sealed_turn_exactly_like_the_local_path
2026-08-18T01:05:21.9328670Z         PASS [   0.112s] ( 183/2567) spt::bin/spt cli::tests::create_prints_joining_material_when_elevated
2026-08-18T01:05:21.9348348Z         PASS [   0.105s] ( 184/2567) spt::bin/spt cli::tests::daemon_offline_hint_only_when_down
2026-08-18T01:05:21.9592381Z         PASS [   0.134s] ( 185/2567) spt::bin/spt cli::tests::create_provisions_the_admin_key_and_show_code_never_does
2026-08-18T01:05:21.9911675Z         PASS [   0.118s] ( 186/2567) spt::bin/spt cli::tests::daemon_refresh_verb_parses
2026-08-18T01:05:22.0032779Z         PASS [   0.117s] ( 187/2567) spt::bin/spt cli::tests::daemonless_apply_message_points_at_finish_or_start
2026-08-18T01:05:22.0059620Z         PASS [   0.110s] ( 188/2567) spt::bin/spt cli::tests::deferred_elevation_gate_matrix
2026-08-18T01:05:22.0099287Z         PASS [   0.132s] ( 189/2567) spt::bin/spt cli::tests::daemon_subcommands_parse
2026-08-18T01:05:22.0138049Z         PASS [   0.111s] ( 190/2567) spt::bin/spt cli::tests::digest_cursor_flags_parse
2026-08-18T01:05:22.0204877Z         PASS [   0.111s] ( 191/2567) spt::bin/spt cli::tests::digest_flag_defaults
2026-08-18T01:05:22.0226982Z         PASS [   0.108s] ( 192/2567) spt::bin/spt cli::tests::digest_human_path_keeps_the_stderr_trailer
2026-08-18T01:05:22.0263759Z         PASS [   0.247s] ( 193/2567) spt::bin/spt api::startup::tests::api_bind_admits_the_reserved_id_only_as_a_bring_ups_completion
2026-08-18T01:05:22.0284868Z         PASS [   0.104s] ( 194/2567) spt::bin/spt cli::tests::digest_json_carries_version_and_leaves_stderr_clean
2026-08-18T01:05:22.0333553Z         PASS [   0.103s] ( 195/2567) spt::bin/spt cli::tests::digest_json_predates_path_still_carries_version
2026-08-18T01:05:22.0374546Z         PASS [   0.105s] ( 196/2567) spt::bin/spt cli::tests::empty_store_no_flag_guides_to_pair_or_create
2026-08-18T01:05:22.0432079Z         PASS [   0.108s] ( 197/2567) spt::bin/spt cli::tests::endpoint_caller_is_denied_and_a_human_caller_is_not
2026-08-18T01:05:22.0591182Z         PASS [   0.056s] ( 198/2567) spt::bin/spt cli::tests::endpoint_row_json_endpoint_type_is_additive
2026-08-18T01:05:22.0591754Z         PASS [   0.069s] ( 199/2567) spt::bin/spt cli::tests::endpoint_role_parses
2026-08-18T01:05:22.0865793Z         PASS [   0.077s] ( 200/2567) spt::bin/spt cli::tests::endpoint_subcommands_parse
2026-08-18T01:05:22.1200587Z         PASS [   0.106s] ( 201/2567) spt::bin/spt cli::tests::engine_room_ceremony_decision_table
2026-08-18T01:05:22.1291517Z         PASS [   0.109s] ( 202/2567) spt::bin/spt cli::tests::engine_room_purge_resets_under_elevation_and_refuses_without_it
2026-08-18T01:05:22.1417244Z         PASS [   0.119s] ( 203/2567) spt::bin/spt cli::tests::escalation_choice_parses_fail_closed
2026-08-18T01:05:22.1510695Z         PASS [   0.630s] ( 204/2567) spt::bin/spt cli::tests::an_engine_room_reset_wipes_records_but_never_deletes_the_engine_room
2026-08-18T01:05:22.1522087Z         PASS [   0.123s] ( 205/2567) spt::bin/spt cli::tests::every_mint_persist_site_asks_the_shared_probe
2026-08-18T01:05:22.1662593Z         PASS [   0.122s] ( 206/2567) spt::bin/spt cli::tests::every_send_outcome_is_answered_by_exactly_one_renderer
2026-08-18T01:05:22.1858579Z         PASS [   0.148s] ( 207/2567) spt::bin/spt cli::tests::every_read_status_command_accepts_the_global_json_flag
2026-08-18T01:05:22.1974808Z         PASS [   0.164s] ( 208/2567) spt::bin/spt cli::tests::every_node_subcommand_parses_identically_under_the_daemon_alias
2026-08-18T01:05:22.2252032Z         PASS [   0.219s] ( 209/2567) spt::bin/spt cli::tests::endpoint_stop_marks_offline
2026-08-18T01:05:22.2409330Z         PASS [   0.121s] ( 210/2567) spt::bin/spt cli::tests::fetch_reject_action_apply_decision
2026-08-18T01:05:22.2459301Z         PASS [   0.117s] ( 211/2567) spt::bin/spt cli::tests::filter_after_excludes_at_or_below_cursor
2026-08-18T01:05:22.2530946Z         PASS [   0.111s] ( 212/2567) spt::bin/spt cli::tests::filter_after_predates_window_returns_full
2026-08-18T01:05:22.2559774Z         PASS [   0.105s] ( 213/2567) spt::bin/spt cli::tests::finish_message_states_fully_live_no_manual_restart
2026-08-18T01:05:22.2693837Z         PASS [   0.104s] ( 214/2567) spt::bin/spt cli::tests::gh_download_command_no_tag_omits_tag
2026-08-18T01:05:22.2741396Z         PASS [   0.088s] ( 215/2567) spt::bin/spt cli::tests::gh_download_command_with_tag_shape
2026-08-18T01:05:22.2793383Z         PASS [   0.082s] ( 216/2567) spt::bin/spt cli::tests::gh_failure_classes_render_os_correct_hints
2026-08-18T01:05:22.2800707Z         PASS [   0.221s] ( 217/2567) spt::bin/spt cli::tests::extract_legacy_flat_stays_flat
2026-08-18T01:05:22.2975090Z         PASS [   0.238s] ( 218/2567) spt::bin/spt cli::tests::extract_multiplatform_missing_my_triple_is_typed_rejection
2026-08-18T01:05:22.3059456Z         PASS [   0.219s] ( 219/2567) spt::bin/spt cli::tests::extract_multiplatform_places_shared_root_and_flattens_my_triple
2026-08-18T01:05:22.3310298Z         PASS [   0.106s] ( 220/2567) spt::bin/spt cli::tests::gh_release_version_compare_decision
2026-08-18T01:05:22.3376207Z         PASS [   0.097s] ( 221/2567) spt::bin/spt cli::tests::gh_version_command_shape
2026-08-18T01:05:22.3539146Z         PASS [   0.108s] ( 222/2567) spt::bin/spt cli::tests::grant_subcommands_parse
2026-08-18T01:05:22.3564282Z         PASS [   0.103s] ( 223/2567) spt::bin/spt cli::tests::help_groups_cover_every_command
2026-08-18T01:05:22.7012076Z         PASS [   0.427s] ( 224/2567) spt::bin/spt cli::tests::inbound_json_speaks_in_the_two_states_the_human_view_is_silent_in
2026-08-18T01:05:22.7039021Z         PASS [   0.434s] ( 225/2567) spt::bin/spt cli::tests::how_to_topics_cover_ready_and_send
2026-08-18T01:05:22.7058102Z         PASS [   0.426s] ( 226/2567) spt::bin/spt cli::tests::inbound_verdict_rides_the_json_in_every_state_including_ok
2026-08-18T01:05:22.7121104Z         PASS [   0.456s] ( 227/2567) spt::bin/spt cli::tests::hot_path_flat_and_moved_verbs_gone
2026-08-18T01:05:22.7154231Z         PASS [   0.418s] ( 228/2567) spt::bin/spt cli::tests::install_platform_check_gates_stamp_and_host_arch
2026-08-18T01:05:22.7205111Z         PASS [   0.414s] ( 229/2567) spt::bin/spt cli::tests::instance_rows_palette_and_align
2026-08-18T01:05:22.7213644Z         PASS [   0.441s] ( 230/2567) spt::bin/spt cli::tests::install_place_is_idempotent_and_path_block_detected
2026-08-18T01:05:22.7274248Z         PASS [   0.396s] ( 231/2567) spt::bin/spt cli::tests::instance_rows_project_column
2026-08-18T01:05:22.7390006Z         PASS [   0.401s] ( 232/2567) spt::bin/spt cli::tests::invalid_usage_errors
2026-08-18T01:05:22.7390600Z         PASS [   0.385s] ( 233/2567) spt::bin/spt cli::tests::join_gate_refuses_without_confirmed_elevation
2026-08-18T01:05:22.7896112Z         PASS [   0.433s] ( 234/2567) spt::bin/spt cli::tests::json_activity_key_is_local_only_and_skips_when_unknown
2026-08-18T01:05:22.7964029Z         PASS [   0.095s] ( 235/2567) spt::bin/spt cli::tests::json_activity_words_come_from_the_shared_vocabulary_source
2026-08-18T01:05:22.8013993Z         PASS [   0.097s] ( 236/2567) spt::bin/spt cli::tests::json_payload_rides_as_attr_alongside_body
2026-08-18T01:05:22.8059726Z         PASS [   0.100s] ( 237/2567) spt::bin/spt cli::tests::json_project_field_skip_if_none
2026-08-18T01:05:22.8104938Z         PASS [   0.098s] ( 238/2567) spt::bin/spt cli::tests::knock_surfaces_speaks_the_tables_vocabulary_and_refuses_the_rest
2026-08-18T01:05:22.8140431Z         PASS [   0.099s] ( 239/2567) spt::bin/spt cli::tests::local_dtos_carry_host_error_and_omit_it_when_clean
2026-08-18T01:05:22.8180608Z         PASS [   0.098s] ( 240/2567) spt::bin/spt cli::tests::malformed_tuple_flags_refuse_with_a_usable_diagnostic
2026-08-18T01:05:22.8336314Z         PASS [   0.094s] ( 241/2567) spt::bin/spt cli::tests::no_redeem_surface_claims_a_reverse_the_minting_side_could_not_open
2026-08-18T01:05:22.8421761Z         PASS [   0.115s] ( 242/2567) spt::bin/spt cli::tests::multi_subnet_refuses_without_flag_then_resolves_with_it
2026-08-18T01:05:22.8437644Z         PASS [   0.105s] ( 243/2567) spt::bin/spt cli::tests::new_code_carries_the_acknowledgment_and_the_subnet_through_the_router
2026-08-18T01:05:22.8454253Z         PASS [   0.056s] ( 244/2567) spt::bin/spt cli::tests::node_group_discards_self_and_skips_empty
2026-08-18T01:05:22.8465703Z         PASS [   0.125s] ( 245/2567) spt::bin/spt cli::tests::monic_verbs_parse
2026-08-18T01:05:22.8496459Z         PASS [   0.053s] ( 246/2567) spt::bin/spt cli::tests::node_group_freshest_epoch_wins_and_unions_subnets
2026-08-18T01:05:22.8551577Z         PASS [   0.054s] ( 247/2567) spt::bin/spt cli::tests::node_group_same_id_two_nodes_two_groups
2026-08-18T01:05:22.8588692Z         PASS [   0.053s] ( 248/2567) spt::bin/spt cli::tests::node_grouped_render_structure_and_palette
2026-08-18T01:05:22.8744271Z         PASS [   0.064s] ( 249/2567) spt::bin/spt cli::tests::node_level_label_names_an_endpointless_peer
2026-08-18T01:05:22.9120785Z         PASS [   0.098s] ( 250/2567) spt::bin/spt cli::tests::node_rows_disambiguate_only_on_label_collision
2026-08-18T01:05:22.9175466Z         PASS [   0.099s] ( 251/2567) spt::bin/spt cli::tests::node_status_rows_denominator_counts_routable_only
2026-08-18T01:05:22.9249366Z         PASS [   0.091s] ( 252/2567) spt::bin/spt cli::tests::node_status_rows_settle_cheap_signals_probe_only_stale
2026-08-18T01:05:22.9300601Z         PASS [   0.904s] ( 253/2567) spt::bin/spt api::startup::tests::api_listen_admits_the_reserved_id_only_as_a_bring_ups_completion
2026-08-18T01:05:22.9324801Z         PASS [   0.090s] ( 254/2567) spt::bin/spt cli::tests::not_elevated_refuses_without_leaking_code_or_saving
2026-08-18T01:05:22.9378412Z         PASS [   0.094s] ( 255/2567) spt::bin/spt cli::tests::notify_subnet_resolution_home_default
2026-08-18T01:05:22.9470041Z         PASS [   0.100s] ( 256/2567) spt::bin/spt cli::tests::only_a_bake_that_can_admit_the_whole_node_demands_the_acknowledgment
2026-08-18T01:05:22.9510312Z         PASS [   0.106s] ( 257/2567) spt::bin/spt cli::tests::notify_surface_parses
2026-08-18T01:05:22.9525974Z         PASS [   0.103s] ( 258/2567) spt::bin/spt cli::tests::only_rows_with_a_node_are_asked_and_answers_land_on_their_own_row
2026-08-18T01:05:22.9576954Z         PASS [   0.102s] ( 259/2567) spt::bin/spt cli::tests::only_the_send_side_defaults_to_msg
2026-08-18T01:05:22.9625927Z         PASS [   0.104s] ( 260/2567) spt::bin/spt cli::tests::origin_asset_urls_latest_and_tag
2026-08-18T01:05:22.9682248Z         PASS [   0.094s] ( 261/2567) spt::bin/spt cli::tests::own_nested_section_renders_under_this_node_without_moving_the_total
2026-08-18T01:05:23.0493645Z         PASS [   0.124s] ( 262/2567) spt::bin/spt cli::tests::peer_health_line_names_absent_peers_as_their_own_state
2026-08-18T01:05:23.0549743Z         PASS [   0.137s] ( 263/2567) spt::bin/spt cli::tests::pair_namespace_is_gone
2026-08-18T01:05:23.0633857Z         PASS [   0.125s] ( 264/2567) spt::bin/spt cli::tests::poll_until_ready_fastpath_timeout_and_later_success
2026-08-18T01:05:23.0637532Z         PASS [   0.131s] ( 265/2567) spt::bin/spt cli::tests::peer_health_line_names_the_stage_and_stays_silent_when_idle
2026-08-18T01:05:23.0650944Z         PASS [   0.118s] ( 266/2567) spt::bin/spt cli::tests::post_step_notice_arbitration
2026-08-18T01:05:23.0757088Z         PASS [   0.124s] ( 267/2567) spt::bin/spt cli::tests::probe_all_cap_batches_into_windows
2026-08-18T01:05:23.1405264Z         PASS [   0.178s] ( 268/2567) spt::bin/spt cli::tests::project_index_line_states_health_not_presence
2026-08-18T01:05:23.1458072Z         PASS [   0.215s] ( 269/2567) spt::bin/spt api::startup::tests::bind_assigns_home_and_revive_preserves_it
2026-08-18T01:05:23.1458864Z         PASS [   0.176s] ( 270/2567) spt::bin/spt cli::tests::prune_candidates_resolve_never_guess
2026-08-18T01:05:23.1561649Z         PASS [   0.107s] ( 271/2567) spt::bin/spt cli::tests::psyche_companion_is_named_without_a_status
2026-08-18T01:05:23.2076694Z         PASS [   0.062s] ( 272/2567) spt::bin/spt cli::tests::remote_cell_project_ref_from_gossiped_recent_projects
2026-08-18T01:05:23.2144234Z         PASS [   0.058s] ( 273/2567) spt::bin/spt cli::tests::requesting_verbs_force_an_explicit_directionality
2026-08-18T01:05:23.2248874Z         PASS [   0.149s] ( 274/2567) spt::bin/spt cli::tests::registered_github_home_detects_active_collision
2026-08-18T01:05:23.2266974Z         PASS [   0.163s] ( 275/2567) spt::bin/spt cli::tests::purge_offline_gate_and_self_guard
2026-08-18T01:05:23.2403734Z         PASS [   0.283s] ( 276/2567) spt::bin/spt cli::tests::probe_all_timeout_settles_false_without_stalling_batch
2026-08-18T01:05:23.2748643Z         PASS [   0.220s] ( 277/2567) spt::bin/spt cli::tests::public_help_carries_no_internal_codes_at_any_ruled_site
2026-08-18T01:05:23.2808514Z         PASS [   0.328s] ( 278/2567) spt::bin/spt cli::tests::probe_all_runs_concurrently_in_input_order
2026-08-18T01:05:23.2960390Z         PASS [   0.081s] ( 279/2567) spt::bin/spt cli::tests::resolve_transport_auto_follows_probe
2026-08-18T01:05:23.3048652Z         PASS [   0.080s] ( 280/2567) spt::bin/spt cli::tests::resolve_transport_explicit_never_probes
2026-08-18T01:05:23.3049284Z         PASS [   0.097s] ( 281/2567) spt::bin/spt cli::tests::resolve_proof_target_override_reads_on_disk
2026-08-18T01:05:23.3158181Z         PASS [   0.075s] ( 282/2567) spt::bin/spt cli::tests::rest_filter_status_first_ordering
2026-08-18T01:05:23.3158923Z         PASS [   0.089s] ( 283/2567) spt::bin/spt cli::tests::rest_filter_hides_suspended_shows_all_and_corrupt_always
2026-08-18T01:05:23.3194599Z         PASS [   0.045s] ( 284/2567) spt::bin/spt cli::tests::rest_filter_total_disclosure_and_corrupt_annotation
2026-08-18T01:05:23.3242631Z         PASS [   0.179s] ( 285/2567) spt::bin/spt api::startup::tests::bind_gateway_earns_no_online_stamp
2026-08-18T01:05:23.3802188Z         PASS [   0.239s] ( 286/2567) spt::bin/spt cli::tests::release_archive_extracts_to_a_registrable_root
2026-08-18T01:05:23.4008229Z         PASS [   0.120s] ( 287/2567) spt::bin/spt cli::tests::restart_plans_lethal_leg_last
2026-08-18T01:05:23.4140875Z         PASS [   0.118s] ( 288/2567) spt::bin/spt cli::tests::ring_no_reply_arms_report_the_wait_in_the_callers_unit
2026-08-18T01:05:23.4164776Z         PASS [   0.112s] ( 289/2567) spt::bin/spt cli::tests::ring_timeout_defaults
2026-08-18T01:05:23.4171812Z         PASS [   0.112s] ( 290/2567) spt::bin/spt cli::tests::ring_timeout_parses_bare_as_minutes_and_honors_suffixes
2026-08-18T01:05:23.4760449Z         PASS [   0.160s] ( 291/2567) spt::bin/spt cli::tests::self_endpoint_line_reports_the_live_relay_or_says_there_is_none
2026-08-18T01:05:23.4812975Z         PASS [   0.162s] ( 292/2567) spt::bin/spt cli::tests::self_pin_annotates_host_error
2026-08-18T01:05:23.4920812Z         PASS [   0.112s] ( 293/2567) spt::bin/spt cli::tests::self_pin_annotates_psyche_host_failure
2026-08-18T01:05:23.4960165Z         PASS [   0.095s] ( 294/2567) spt::bin/spt cli::tests::self_pin_annotates_translation_fault
2026-08-18T01:05:23.5018811Z         PASS [   0.088s] ( 295/2567) spt::bin/spt cli::tests::self_pin_includes_description_when_present
2026-08-18T01:05:23.5170845Z         PASS [   0.201s] ( 296/2567) spt::bin/spt cli::tests::run_bounded_yields_value_or_timeout_default
2026-08-18T01:05:23.5634580Z         PASS [   0.147s] ( 297/2567) spt::bin/spt cli::tests::send_reply_to_flag_is_removed_and_target_required
2026-08-18T01:05:23.5683367Z         PASS [   0.151s] ( 298/2567) spt::bin/spt cli::tests::send_user_msg_flag_parses
2026-08-18T01:05:23.6172555Z         PASS [   0.049s] ( 299/2567) spt::bin/spt cli::tests::shell_subcommands_parse
2026-08-18T01:05:23.6397355Z         PASS [   0.022s] ( 300/2567) spt::bin/spt cli::tests::show_code_prints_reprovisioning_material
2026-08-18T01:05:23.9351439Z         PASS [   0.372s] ( 301/2567) spt::bin/spt cli::tests::shell_spawn_profiled_option_resolves_and_shares_cap
2026-08-18T01:05:23.9424069Z         PASS [   0.461s] ( 302/2567) spt::bin/spt cli::tests::shell_owner_exclusivity_negatives
2026-08-18T01:05:23.9892535Z         PASS [   2.030s] ( 303/2567) spt::bin/spt cli::tests::endpoint_role_overwrite_is_the_sole_writer
2026-08-18T01:05:24.0095240Z         PASS [   0.367s] ( 304/2567) spt::bin/spt cli::tests::shutdown_and_stop_share_the_postcondition_and_differ_only_in_ceremony
2026-08-18T01:05:24.0337400Z         PASS [   0.044s] ( 305/2567) spt::bin/spt cli::tests::single_subnet_auto_selects_and_code_matches_seed
2026-08-18T01:05:24.0910267Z         PASS [   0.148s] ( 306/2567) spt::bin/spt cli::tests::shutdown_on_a_harness_hosted_endpoint_claims_no_process
2026-08-18T01:05:24.1086083Z         PASS [   0.616s] ( 307/2567) spt::bin/spt cli::tests::shell_relink_relaunches_offline_instances_only
2026-08-18T01:05:24.5678781Z         PASS [   1.066s] ( 308/2567) spt::bin/spt cli::tests::shell_spawn_cap_and_over_cap_gates
2026-08-18T01:05:24.5788890Z         PASS [   1.083s] ( 309/2567) spt::bin/spt cli::tests::shell_spawn_approval_floor_gates
2026-08-18T01:05:24.5900465Z         PASS [   0.556s] ( 310/2567) spt::bin/spt cli::tests::stage_then_swap_failed_fetch_preserves_install
2026-08-18T01:05:24.5962407Z         PASS [   0.661s] ( 311/2567) spt::bin/spt cli::tests::shutdown_on_a_broker_hosted_endpoint_stamps_after_the_reap
2026-08-18T01:05:24.6045556Z         PASS [   0.037s] ( 312/2567) spt::bin/spt cli::tests::stall_evict_line_surfaces_only_a_real_tally
2026-08-18T01:05:24.6062989Z         PASS [   0.027s] ( 313/2567) spt::bin/spt cli::tests::stop_guard_refuses_live_sessions_without_force
2026-08-18T01:05:24.6219287Z         PASS [   0.017s] ( 314/2567) spt::bin/spt cli::tests::subnet_mode_lines_state_declared_captured_and_pending
2026-08-18T01:05:24.6284515Z         PASS [   0.022s] ( 315/2567) spt::bin/spt cli::tests::subnet_status_renders_rows_and_hints_never_secrets
2026-08-18T01:05:24.6331196Z         PASS [   0.043s] ( 316/2567) spt::bin/spt cli::tests::subcommands_parse
2026-08-18T01:05:24.6451995Z         PASS [   0.023s] ( 317/2567) spt::bin/spt cli::tests::subnets_joined_banner_renders_rows_and_divider
2026-08-18T01:05:24.6496235Z         PASS [   1.586s] ( 318/2567) spt::bin/spt cli::tests::purge_force_asks_before_it_tears_anything_down
2026-08-18T01:05:24.6499558Z         PASS [   0.054s] ( 319/2567) spt::bin/spt cli::tests::subnet_arg_shapes_parse
2026-08-18T01:05:24.6511548Z         PASS [   0.023s] ( 320/2567) spt::bin/spt cli::tests::subprocess_detail_prefers_stderr_then_stdout
2026-08-18T01:05:24.6595461Z         PASS [   0.026s] ( 321/2567) spt::bin/spt cli::tests::the_bare_form_is_the_send_form
2026-08-18T01:05:24.6629710Z         PASS [   0.572s] ( 322/2567) spt::bin/spt cli::tests::staged_floor_admits_when_core_meets_floor
2026-08-18T01:05:24.6640854Z         PASS [   0.019s] ( 323/2567) spt::bin/spt cli::tests::the_bare_form_refuses_rather_than_guessing
2026-08-18T01:05:24.6692138Z         PASS [   0.020s] ( 324/2567) spt::bin/spt cli::tests::the_bare_node_verb_defaults_to_the_status_view_under_both_spellings
2026-08-18T01:05:24.6702912Z         PASS [   0.020s] ( 325/2567) spt::bin/spt cli::tests::the_bare_status_view_states_the_mode_facts_for_every_row
2026-08-18T01:05:24.6811524Z         PASS [   0.022s] ( 326/2567) spt::bin/spt cli::tests::the_conjunction_notice_fires_per_missing_half_and_stays_silent_when_both_hold
2026-08-18T01:05:24.6869611Z         PASS [   0.024s] ( 327/2567) spt::bin/spt cli::tests::the_conjunction_notice_names_the_whitelist_its_seat_and_the_posture
2026-08-18T01:05:24.6980873Z         PASS [   0.047s] ( 328/2567) spt::bin/spt cli::tests::the_briefing_prescribes_only_verbs_the_grammar_has
2026-08-18T01:05:24.6992467Z         PASS [   0.591s] ( 329/2567) spt::bin/spt cli::tests::staged_floor_refuses_above_floor_and_leaves_dest_untouched
2026-08-18T01:05:24.7032381Z         PASS [   0.039s] ( 330/2567) spt::bin/spt cli::tests::the_create_ceremony_names_the_heal_for_an_older_minter
2026-08-18T01:05:24.7073954Z         PASS [   0.037s] ( 331/2567) spt::bin/spt cli::tests::the_denial_names_the_blast_radius_and_a_cure_that_fits_its_ground
2026-08-18T01:05:24.7131197Z         PASS [   0.044s] ( 332/2567) spt::bin/spt cli::tests::the_cross_node_mutual_refusal_is_gone_from_every_surface_that_carried_it
2026-08-18T01:05:24.7190193Z         PASS [   0.032s] ( 333/2567) spt::bin/spt cli::tests::the_engine_room_briefing_speaks_the_cli_vocabulary
2026-08-18T01:05:24.7264699Z         PASS [   0.045s] ( 334/2567) spt::bin/spt cli::tests::the_deprecation_note_renders_on_both_spellings_of_the_node_verb
2026-08-18T01:05:24.7454803Z         PASS [   0.738s] ( 335/2567) spt::bin/spt cli::tests::spt_hosted_no_relay_detection
2026-08-18T01:05:24.7595907Z         PASS [   1.284s] ( 336/2567) spt::bin/spt cli::tests::shell_channels_relay_sensory_and_text_file
2026-08-18T01:05:24.7805095Z         PASS [   0.077s] ( 337/2567) spt::bin/spt cli::tests::the_fork_pair_consequence_follows_the_chain_verdict_not_the_rule_rows
2026-08-18T01:05:24.7879402Z         PASS [   0.081s] ( 338/2567) spt::bin/spt cli::tests::the_gc_render_says_what_it_refused_and_what_it_would_delete
2026-08-18T01:05:24.7911195Z         PASS [   0.078s] ( 339/2567) spt::bin/spt cli::tests::the_human_and_json_legs_agree_on_every_unlisted_row
2026-08-18T01:05:24.8013681Z         PASS [   0.082s] ( 340/2567) spt::bin/spt cli::tests::the_knock_prescription_names_the_fork_pair_only_where_it_is_needed
2026-08-18T01:05:24.8022930Z         PASS [   0.103s] ( 341/2567) spt::bin/spt cli::tests::the_flagless_access_listing_is_wired_distinctly_from_its_subcommands
2026-08-18T01:05:24.8044850Z         PASS [   0.078s] ( 342/2567) spt::bin/spt cli::tests::the_legacy_allow_echo_says_discover_is_untouched_and_scopes_both_levers
2026-08-18T01:05:24.8158776Z         PASS [   0.056s] ( 343/2567) spt::bin/spt cli::tests::the_mint_probe_answers_only_for_a_fresh_mint
2026-08-18T01:05:24.8371886Z         PASS [   1.513s] ( 344/2567) spt::bin/spt api::startup::tests::bind_listen_control_detach_keeps_the_earned_hosting_authority
2026-08-18T01:05:24.8433057Z         PASS [   0.055s] ( 345/2567) spt::bin/spt cli::tests::the_presenters_three_renderings_stay_three_things
2026-08-18T01:05:24.8522628Z         PASS [   0.051s] ( 346/2567) spt::bin/spt cli::tests::the_rendered_peer_fraction_counts_one_population_across_a_subnet_leave
2026-08-18T01:05:24.8525076Z         PASS [   0.061s] ( 347/2567) spt::bin/spt cli::tests::the_remote_knock_refusals_render_as_prose
2026-08-18T01:05:24.8825229Z         PASS [   0.184s] ( 348/2567) spt::bin/spt cli::tests::the_evidence_census_reads_each_local_source
2026-08-18T01:05:24.8831198Z         PASS [   0.081s] ( 349/2567) spt::bin/spt cli::tests::the_rendered_section_is_the_composers_output
2026-08-18T01:05:24.8992218Z         PASS [   0.045s] ( 350/2567) spt::bin/spt cli::tests::the_three_send_outcomes_owe_three_different_receipts
2026-08-18T01:05:24.9003985Z         PASS [   0.057s] ( 351/2567) spt::bin/spt cli::tests::the_three_landings_render_distinct_lines
2026-08-18T01:05:24.9178775Z         PASS [   0.065s] ( 352/2567) spt::bin/spt cli::tests::the_tuple_flags_build_the_rule_they_name
2026-08-18T01:05:24.9402410Z         PASS [   0.057s] ( 353/2567) spt::bin/spt cli::tests::the_unlisted_listing_drops_an_excluded_peer_and_keeps_the_rest
2026-08-18T01:05:24.9496263Z         PASS [   0.032s] ( 354/2567) spt::bin/spt cli::tests::this_node_group_merges_roster_with_unbound_truth
2026-08-18T01:05:24.9509138Z         PASS [   0.068s] ( 355/2567) spt::bin/spt cli::tests::the_unspooled_remedy_prescribes_a_verb_the_grammar_has
2026-08-18T01:05:24.9535905Z         PASS [   0.056s] ( 356/2567) spt::bin/spt cli::tests::the_visible_alias_reaches_the_root_listing
2026-08-18T01:05:24.9587405Z         PASS [   0.018s] ( 357/2567) spt::bin/spt cli::tests::trust_mutation_gate_refuses_without_confirmed_elevation
2026-08-18T01:05:24.9734309Z         PASS [   0.022s] ( 358/2567) spt::bin/spt cli::tests::unknown_elevation_falls_back
2026-08-18T01:05:24.9763446Z         PASS [   0.076s] ( 359/2567) spt::bin/spt cli::tests::the_widening_remedy_is_sited_with_its_flag_not_in_the_shared_section
2026-08-18T01:05:24.9814074Z         PASS [   0.032s] ( 360/2567) spt::bin/spt cli::tests::trust_warning_verbs_parse
2026-08-18T01:05:24.9830396Z         PASS [   0.030s] ( 361/2567) spt::bin/spt cli::tests::unknown_named_subnet_is_usage_error
2026-08-18T01:05:24.9962320Z         PASS [   0.038s] ( 362/2567) spt::bin/spt cli::tests::update_adapters_verb_parses_with_optional_names
2026-08-18T01:05:24.9993891Z         PASS [   0.026s] ( 363/2567) spt::bin/spt cli::tests::update_fetch_apply_flag_parses
2026-08-18T01:05:24.9994729Z         PASS [   0.023s] ( 364/2567) spt::bin/spt cli::tests::what_the_listing_prescribes_is_what_the_approve_path_honors
2026-08-18T01:05:25.0216699Z         PASS [   0.206s] ( 365/2567) spt::bin/spt cli::tests::the_surface_section_rides_the_ruled_sites_and_no_others
2026-08-18T01:05:25.0415756Z         PASS [   0.237s] ( 366/2567) spt::bin/spt cli::tests::the_seat_and_the_acknowledgment_are_the_mints_and_both_arms_refuse_alike
2026-08-18T01:05:25.0557686Z         PASS [   0.074s] ( 367/2567) spt::bin/spt cli::tests::whoami_parses_as_the_identity_verb
2026-08-18T01:05:25.0784063Z         PASS [   0.241s] ( 368/2567) spt::bin/spt api::startup::tests::bind_live_agent_over_prior_ready_agent_earns_online_on_controllable_with_preserved_type
2026-08-18T01:05:25.0819282Z         PASS [   0.082s] ( 369/2567) spt::bin/spt elevation::tests::already_elevated_short_circuits_on_every_os
2026-08-18T01:05:25.0914540Z         PASS [   0.092s] ( 370/2567) spt::bin/spt elevation::tests::current_returns_a_determinate_level_on_supported_platforms
2026-08-18T01:05:25.1108971Z         PASS [   0.128s] ( 371/2567) spt::bin/spt cli::verb_surface_route_table::every_bringup_door_routes_where_it_says
2026-08-18T01:05:25.1144900Z         PASS [   0.118s] ( 372/2567) spt::bin/spt cli::verb_surface_route_table::the_exclusions_are_real_refusals
2026-08-18T01:05:25.1196373Z         PASS [   0.077s] ( 373/2567) spt::bin/spt elevation::tests::gate_shows_only_when_confirmed_elevated
2026-08-18T01:05:25.1197081Z         PASS [   0.064s] ( 374/2567) spt::bin/spt elevation::tests::launcher_argv_is_absolute_exe_plus_verbatim_args
2026-08-18T01:05:25.1356966Z         PASS [   0.114s] ( 375/2567) spt::bin/spt elevation::tests::fallback_message_names_authenticator_app_and_subnet
2026-08-18T01:05:25.1400640Z         PASS [   0.394s] ( 376/2567) spt::bin/spt cli::tests::the_local_and_wire_arms_write_one_identical_grant
2026-08-18T01:05:25.1449951Z         PASS [   0.053s] ( 377/2567) spt::bin/spt elevation::tests::print_hint_floor_uses_absolute_path_each_os
2026-08-18T01:05:25.1632274Z         PASS [   0.081s] ( 378/2567) spt::bin/spt elevation::tests::launchers_never_shell_interpolate_a_crafted_arg
2026-08-18T01:05:25.1682161Z         PASS [   0.053s] ( 379/2567) spt::bin/spt elevation::tests::windows_uac_only_interactive_other_always_prints
2026-08-18T01:05:25.1779958Z         PASS [   0.067s] ( 380/2567) spt::bin/spt elevation::tests::unix_path_order_tty_then_pkexec_then_terminal_then_hint
2026-08-18T01:05:25.1831124Z         PASS [   0.063s] ( 381/2567) spt::bin/spt helpfmt::tests::bold_styles_with_color_and_strips_without
2026-08-18T01:05:25.2006698Z         PASS [   0.082s] ( 382/2567) spt::bin/spt helpfmt::tests::atx_header_at_line_start_strips_and_bolds
2026-08-18T01:05:25.2088889Z         PASS [   0.045s] ( 383/2567) spt::bin/spt helpfmt::tests::dual_contract_token_unstyled_while_prose_styles_on_color
2026-08-18T01:05:25.2089715Z         PASS [   0.041s] ( 384/2567) spt::bin/spt helpfmt::tests::empty_and_unmatched_markers_stay_literal
2026-08-18T01:05:25.2108649Z         PASS [   0.070s] ( 385/2567) spt::bin/spt helpfmt::tests::color_enabled_truth_table
2026-08-18T01:05:25.2112547Z         PASS [   0.076s] ( 386/2567) spt::bin/spt helpfmt::tests::code_styles_with_color_and_strips_without
2026-08-18T01:05:25.2127178Z         PASS [   0.030s] ( 387/2567) spt::bin/spt helpfmt::tests::marker_never_spans_a_hard_break
2026-08-18T01:05:25.2161175Z         PASS [   0.038s] ( 388/2567) spt::bin/spt helpfmt::tests::link_becomes_its_text
2026-08-18T01:05:25.2207913Z         PASS [   0.076s] ( 389/2567) spt::bin/spt helpfmt::tests::dual_contract_token_survives_strip_mode
2026-08-18T01:05:25.2244775Z         PASS [   0.024s] ( 390/2567) spt::bin/spt helpfmt::tests::marker_spans_a_clap_soft_wrap
2026-08-18T01:05:25.2275022Z         PASS [   0.019s] ( 391/2567) spt::bin/spt helpfmt::tests::nested_code_inside_bold_styles_both
2026-08-18T01:05:25.2305341Z         PASS [   0.022s] ( 392/2567) spt::bin/spt helpfmt::tests::multibyte_text_survives
2026-08-18T01:05:25.2343994Z         PASS [   0.024s] ( 393/2567) spt::bin/spt helpfmt::tests::plain_text_is_unchanged
2026-08-18T01:05:25.2387882Z         PASS [   0.028s] ( 394/2567) spt::bin/spt helpfmt::tests::preexisting_ansi_is_passed_through_untouched
2026-08-18T01:05:25.2896118Z         PASS [   0.077s] ( 395/2567) spt::bin/spt helpfmt::tests::resolve_console_color_strips_when_vt_unavailable
2026-08-18T01:05:25.2936978Z         PASS [   0.078s] ( 396/2567) spt::bin/spt monicverb::tests::add_refuses_to_replace_and_update_refuses_to_invent
2026-08-18T01:05:25.2992745Z         PASS [   0.079s] ( 397/2567) spt::bin/spt monicverb::tests::no_monic_verb_is_elevation_gated
2026-08-18T01:05:25.3046901Z         PASS [   0.080s] ( 398/2567) spt::bin/spt picker::data::tests::disambiguate_project_ids_cases
2026-08-18T01:05:25.3110600Z         PASS [   0.084s] ( 399/2567) spt::bin/spt picker::data::tests::driven_by_display_renders_name_not_hex
2026-08-18T01:05:25.3132918Z         PASS [   0.235s] ( 400/2567) spt::bin/spt api::startup::tests::bind_records_cwd_so_picker_can_group_by_project
2026-08-18T01:05:25.3308815Z         PASS [   0.041s] ( 401/2567) spt::bin/spt picker::data::tests::indexed_projection_full_w2shaped_and_absent_legs
2026-08-18T01:05:25.3380230Z         PASS [   0.044s] ( 402/2567) spt::bin/spt picker::data::tests::non_drivable_predicate_covers_worker_and_psyche
2026-08-18T01:05:25.3588830Z         PASS [   0.048s] ( 403/2567) spt::bin/spt picker::data::tests::project_refs_from_sessions_excludes_owlery_and_dedups_newest_first
2026-08-18T01:05:25.3797181Z         PASS [   0.048s] ( 404/2567) spt::bin/spt picker::data::tests::project_refs_from_unions_fresh_origin_and_store_branches
2026-08-18T01:05:25.3799698Z         PASS [   0.081s] ( 405/2567) spt::bin/spt picker::data::tests::own_node_tab_label_falls_back_to_keyprefix
2026-08-18T01:05:25.3896748Z         PASS [   0.051s] ( 406/2567) spt::bin/spt picker::data::tests::reconcile_overrides_subnet_with_local_roster
2026-08-18T01:05:25.4020760Z         PASS [   0.088s] ( 407/2567) spt::bin/spt api::startup::tests::bind_refuses_a_session_id_that_squats_a_psyche_custody_sid
2026-08-18T01:05:25.4106836Z         PASS [   0.031s] ( 408/2567) spt::bin/spt picker::data::tests::resume_rows_derive_per_row_project_and_drop_owlery_sessions
2026-08-18T01:05:25.4290174Z         PASS [   0.018s] ( 409/2567) spt::bin/spt picker::data::tests::row_status_drives_unbound_display
2026-08-18T01:05:25.4407632Z         PASS [   0.051s] ( 410/2567) spt::bin/spt picker::data::tests::resume_rows_title_from_index_cwd_map_with_pure_fallback
2026-08-18T01:05:25.4663358Z         PASS [   0.107s] ( 411/2567) spt::bin/spt picker::data::tests::remote_picker_renders_suspended_dead_perch_offline
2026-08-18T01:05:25.4789499Z         PASS [   0.099s] ( 412/2567) spt::bin/spt picker::data::tests::remote_rows_render_full_palette_parity
2026-08-18T01:05:25.4831100Z         PASS [   0.252s] ( 413/2567) spt::bin/spt picker::data::tests::gather_endpoints_projects_from_seeded_index_with_zero_git
2026-08-18T01:05:25.4833506Z         PASS [   0.249s] ( 414/2567) spt::bin/spt picker::data::tests::gather_renders_live_unbound
2026-08-18T01:05:25.4864406Z         PASS [   0.045s] ( 415/2567) spt::bin/spt picker::model::tests::adapter_tree_nests_profiles
2026-08-18T01:05:25.5198789Z         PASS [   0.091s] ( 416/2567) spt::bin/spt picker::data::tests::shared_machine_is_one_group_with_unioned_subnets
2026-08-18T01:05:25.5478307Z         PASS [   0.243s] ( 417/2567) spt::bin/spt picker::data::tests::picker_excludes_flat_worker_and_psyche
2026-08-18T01:05:25.5534673Z         PASS [   0.074s] ( 418/2567) spt::bin/spt picker::model::tests::build_project_choices_head_here_rest
2026-08-18T01:05:25.5702846Z         PASS [   0.104s] ( 419/2567) spt::bin/spt picker::model::tests::back_unwinds
2026-08-18T01:05:25.5796430Z         PASS [   0.093s] ( 420/2567) spt::bin/spt picker::model::tests::change_adapter_picks_and_returns_to_confirm
2026-08-18T01:05:25.5893188Z         PASS [   0.106s] ( 421/2567) spt::bin/spt picker::model::tests::category_labels_render_display_forms
2026-08-18T01:05:25.5929906Z         PASS [   0.191s] ( 422/2567) spt::bin/spt api::startup::tests::bind_with_type_establishes_a_gateway_endpoint
2026-08-18T01:05:25.5998919Z         PASS [   0.047s] ( 423/2567) spt::bin/spt picker::model::tests::confirm_options_remote_suspended_is_wake_not_start
2026-08-18T01:05:25.6018383Z         PASS [   0.054s] ( 424/2567) spt::bin/spt picker::model::tests::confirm_local_offline_unchanged_by_wake_split
2026-08-18T01:05:25.6066025Z         PASS [   0.087s] ( 425/2567) spt::bin/spt picker::model::tests::choose_project_outcome_bakes_cwd_and_diverts
2026-08-18T01:05:25.6109621Z         PASS [   0.031s] ( 426/2567) spt::bin/spt picker::model::tests::confirm_terminal_routes
2026-08-18T01:05:25.6110294Z         PASS [   0.040s] ( 427/2567) spt::bin/spt picker::model::tests::confirm_options_status_dependent
2026-08-18T01:05:25.6123066Z         PASS [   0.129s] ( 428/2567) spt::bin/spt picker::model::tests::category_ring_wraps
2026-08-18T01:05:25.6143985Z         PASS [   0.025s] ( 429/2567) spt::bin/spt picker::model::tests::confirm_terminal_wake_carries_raw_node
2026-08-18T01:05:25.6437771Z         PASS [   0.051s] ( 430/2567) spt::bin/spt api::startup::tests::bind_with_unrelated_sid_is_unaffected_by_the_squat_guard
2026-08-18T01:05:25.6706587Z         PASS [   0.071s] ( 431/2567) spt::bin/spt picker::model::tests::create_new_multisubnet_inserts_home_layer
2026-08-18T01:05:25.6750350Z         PASS [   0.073s] ( 432/2567) spt::bin/spt picker::model::tests::create_outcome_bakes_run
2026-08-18T01:05:25.6799967Z         PASS [   0.073s] ( 433/2567) spt::bin/spt picker::model::tests::cursor_clamps
2026-08-18T01:05:25.6851890Z         PASS [   0.074s] ( 434/2567) spt::bin/spt picker::model::tests::display_mapping_matrix
2026-08-18T01:05:25.6892761Z         PASS [   0.078s] ( 435/2567) spt::bin/spt picker::model::tests::display_status_four_state_type_gated
2026-08-18T01:05:25.6957974Z         PASS [   0.083s] ( 436/2567) spt::bin/spt picker::model::tests::display_status_unbound_is_hollow_and_attachable
2026-08-18T01:05:25.6999759Z         PASS [   0.085s] ( 437/2567) spt::bin/spt picker::model::tests::empty_scope_opens_create
2026-08-18T01:05:25.7050479Z         PASS [   0.466s] ( 438/2567) spt::bin/spt picker::data::tests::home_subnet_options_is_mru_ordered
2026-08-18T01:05:25.7123228Z         PASS [   0.041s] ( 439/2567) spt::bin/spt picker::model::tests::ep_display_glyph_and_square_palette
2026-08-18T01:05:25.7149619Z         PASS [   0.071s] ( 440/2567) spt::bin/spt api::startup::tests::empty_session_seed_refusal_spends_the_seed_no_restore
2026-08-18T01:05:25.7192070Z         PASS [   0.044s] ( 441/2567) spt::bin/spt picker::model::tests::esc_backs_out_of_home_layer
2026-08-18T01:05:25.7225871Z         PASS [   0.043s] ( 442/2567) spt::bin/spt picker::model::tests::filter_narrows
2026-08-18T01:05:25.7287081Z         PASS [   0.043s] ( 443/2567) spt::bin/spt picker::model::tests::from_resource_row_maps_gossiped_adapter_projects_controlled
2026-08-18T01:05:25.7336473Z         PASS [   0.044s] ( 444/2567) spt::bin/spt picker::model::tests::home_selection_bakes_into_run_subnet
2026-08-18T01:05:25.7381413Z         PASS [   0.042s] ( 445/2567) spt::bin/spt picker::model::tests::kind_routes
2026-08-18T01:05:25.7448215Z         PASS [   0.045s] ( 446/2567) spt::bin/spt picker::model::tests::launch_keys_live_only_on_launch_capable_highlights
2026-08-18T01:05:25.7501909Z         PASS [   0.045s] ( 447/2567) spt::bin/spt picker::model::tests::prefill_jumps_to_create
2026-08-18T01:05:25.7564706Z         PASS [   0.044s] ( 448/2567) spt::bin/spt picker::model::tests::project_filter_keys_on_slug_while_tab_renders_display
2026-08-18T01:05:25.7656653Z         PASS [   0.046s] ( 449/2567) spt::bin/spt picker::model::tests::purge_confirm_yields_outcome_and_backs_out
2026-08-18T01:05:25.7680162Z         PASS [   0.053s] ( 450/2567) spt::bin/spt api::startup::tests::empty_session_seed_refused
2026-08-18T01:05:25.7719437Z         PASS [   0.049s] ( 451/2567) spt::bin/spt picker::model::tests::purge_shortcut_gates_to_offline_local
2026-08-18T01:05:25.7781394Z         PASS [   0.049s] ( 452/2567) spt::bin/spt picker::model::tests::reenter_create_keeps_or_clears_id
2026-08-18T01:05:25.7832645Z         PASS [   0.050s] ( 453/2567) spt::bin/spt picker::model::tests::remove_endpoint_drops_row_and_clamps_cursor
2026-08-18T01:05:25.7886601Z         PASS [   0.050s] ( 454/2567) spt::bin/spt picker::model::tests::resume_outcome_adapter_follows_recorded_row
2026-08-18T01:05:25.7931015Z         PASS [   0.048s] ( 455/2567) spt::bin/spt picker::model::tests::resume_outcome_bakes_session
2026-08-18T01:05:25.7971224Z         PASS [   0.047s] ( 456/2567) spt::bin/spt picker::model::tests::resume_title_render
2026-08-18T01:05:25.8470162Z         PASS [   0.090s] ( 457/2567) spt::bin/spt picker::model::tests::should_offer_project_choice_fire_conditions
2026-08-18T01:05:25.8528396Z         PASS [   0.087s] ( 458/2567) spt::bin/spt picker::model::tests::single_subnet_skips_home_layer
2026-08-18T01:05:25.8699741Z         PASS [   0.098s] ( 459/2567) spt::bin/spt picker::model::tests::suspended_is_distinct_from_offline
2026-08-18T01:05:25.8730523Z         PASS [   0.095s] ( 460/2567) spt::bin/spt picker::model::tests::the_picker_refuses_the_reserved_id_as_it_is_typed
2026-08-18T01:05:25.8780888Z         PASS [   0.095s] ( 461/2567) spt::bin/spt picker::model::tests::visible_partitions_and_sorts
2026-08-18T01:05:25.8858661Z         PASS [   0.096s] ( 462/2567) spt::bin/spt picker::shortcut::tests::basename_is_parameterized
2026-08-18T01:05:25.8916754Z         PASS [   0.019s] ( 463/2567) spt::bin/spt picker::tests::purge_outcomes_convert_to_flash_lines
2026-08-18T01:05:25.8957708Z         PASS [   0.099s] ( 464/2567) spt::bin/spt picker::shortcut::tests::the_body_is_the_ladder_verb
2026-08-18T01:05:25.9074093Z         PASS [   0.055s] ( 465/2567) spt::bin/spt picker::tests::backspace_backs_out_screens_like_esc
2026-08-18T01:05:25.9154781Z         PASS [   0.045s] ( 466/2567) spt::bin/spt picker::tests::backspace_stays_char_delete_in_text_contexts
2026-08-18T01:05:25.9196411Z         PASS [   0.126s] ( 467/2567) spt::bin/spt picker::shortcut::tests::sentinel_detection_spans_both_generations
2026-08-18T01:05:25.9473560Z         PASS [   0.100s] ( 468/2567) spt::bin/spt picker::shortcut::tests::write_create_update_regenerate_refuse
2026-08-18T01:05:25.9601353Z         PASS [   0.082s] ( 469/2567) spt::bin/spt picker::tests::purge_transition_reconstructs_the_complete_screen_after_external_mutation
2026-08-18T01:05:25.9621283Z         PASS [   0.076s] ( 470/2567) spt::bin/spt picker::view::tests::adapter_tree_buffer
2026-08-18T01:05:25.9680106Z         PASS [   0.076s] ( 471/2567) spt::bin/spt picker::view::tests::change_adapter_screen_renders_tree_and_apply_legend
2026-08-18T01:05:25.9716183Z         PASS [   0.076s] ( 472/2567) spt::bin/spt picker::view::tests::choose_project_buffer_keeps_confirm_panel
2026-08-18T01:05:25.9817964Z         PASS [   0.066s] ( 473/2567) spt::bin/spt picker::view::tests::confirm_fork_and_shortcut_labels_are_dir_relative
2026-08-18T01:05:25.9839767Z         PASS [   0.077s] ( 474/2567) spt::bin/spt picker::view::tests::confirm_buffer_options
2026-08-18T01:05:25.9901241Z         PASS [   0.043s] ( 475/2567) spt::bin/spt picker::view::tests::create_home_lists_subnets
2026-08-18T01:05:25.9927038Z         PASS [   0.073s] ( 476/2567) spt::bin/spt picker::view::tests::confirm_panel_history_renders_display_not_slug
2026-08-18T01:05:25.9972470Z         PASS [   0.037s] ( 477/2567) spt::bin/spt picker::view::tests::every_picker_list_view_keeps_its_caret_on_screen
2026-08-18T01:05:26.0450765Z         PASS [   0.077s] ( 478/2567) spt::bin/spt picker::view::tests::kind_buffer
2026-08-18T01:05:26.0529788Z         PASS [   0.081s] ( 479/2567) spt::bin/spt picker::view::tests::pick_buffer_has_squares_and_description
2026-08-18T01:05:26.0564488Z         PASS [   0.075s] ( 480/2567) spt::bin/spt picker::view::tests::pick_empty_category_hint
2026-08-18T01:05:26.0596283Z         PASS [   0.097s] ( 481/2567) spt::bin/spt picker::view::tests::footer_hints_h_s_only_when_launch_keys_live
2026-08-18T01:05:26.0639198Z         PASS [   0.074s] ( 482/2567) spt::bin/spt picker::view::tests::resume_buffer_keeps_confirm_panel
2026-08-18T01:05:26.0700334Z         PASS [   0.077s] ( 483/2567) spt::bin/spt picker::view::tests::resume_buffer_lists_sessions
2026-08-18T01:05:26.0754681Z         PASS [   0.078s] ( 484/2567) spt::bin/spt picker::view::tests::the_caret_row_accounts_for_the_group_headers_above_it
2026-08-18T01:05:26.0808317Z         PASS [   0.028s] ( 485/2567) spt::bin/spt rc::tests::a_bringable_target_reaches_bring_up_with_the_offline_row_present
2026-08-18T01:05:26.0848955Z         PASS [   0.040s] ( 486/2567) spt::bin/spt picker::view::tests::the_caret_stays_on_screen_when_the_list_outruns_the_viewport
2026-08-18T01:05:26.0853908Z         PASS [   0.029s] ( 487/2567) spt::bin/spt rc::tests::a_refusal_names_the_targets_own_entry_surface
2026-08-18T01:05:26.0943025Z         PASS [   0.030s] ( 488/2567) spt::bin/spt rc::tests::attach_gate_routes_on_session_truth_not_the_row
2026-08-18T01:05:26.1029498Z         PASS [   0.027s] ( 489/2567) spt::bin/spt rc::tests::bracketed_paste_framing_is_exact_and_content_verbatim
2026-08-18T01:05:26.1046091Z         PASS [   0.121s] ( 490/2567) spt::bin/spt picker::view::tests::pick_status_line_four_state
2026-08-18T01:05:26.1069555Z         PASS [   0.026s] ( 491/2567) spt::bin/spt rc::tests::bringable_is_the_engine_room_addressed_plainly_with_a_code
2026-08-18T01:05:26.1111798Z         PASS [   0.026s] ( 492/2567) spt::bin/spt rc::tests::bringup_prompt_names_the_node_and_the_home_subnet
2026-08-18T01:05:26.1151280Z         PASS [   0.030s] ( 493/2567) spt::bin/spt rc::tests::canonical_wire_id_strips_qualifiers_to_the_bare_id
2026-08-18T01:05:26.1192068Z         PASS [   0.025s] ( 494/2567) spt::bin/spt rc::tests::classify_read_err_eof_is_graceful_not_fatal
2026-08-18T01:05:26.1232916Z         PASS [   0.020s] ( 495/2567) spt::bin/spt rc::tests::clipboard_paste_wraps_nonempty_and_noops_on_empty_or_failure
2026-08-18T01:05:26.1289230Z         PASS [   0.024s] ( 496/2567) spt::bin/spt rc::tests::detach_keybind_semantics
2026-08-18T01:05:26.1331529Z         PASS [   0.026s] ( 497/2567) spt::bin/spt rc::tests::detach_prefix_spans_chunks
2026-08-18T01:05:26.1394775Z         PASS [   0.028s] ( 498/2567) spt::bin/spt rc::tests::display_guard_postlude_exactly_once_and_inactive_silent
2026-08-18T01:05:26.1453907Z         PASS [   0.030s] ( 499/2567) spt::bin/spt rc::tests::driver_phrase_names_own_node_plainly_but_remote_verbatim
2026-08-18T01:05:26.1559818Z         PASS [   0.033s] ( 500/2567) spt::bin/spt rc::tests::first_event_stall_decision
2026-08-18T01:05:26.1604152Z         PASS [   0.031s] ( 501/2567) spt::bin/spt rc::tests::fold_code_key_prompt_rules
2026-08-18T01:05:26.1648779Z         PASS [   0.032s] ( 502/2567) spt::bin/spt rc::tests::give_up_copy_names_daemon_down_vs_generic
2026-08-18T01:05:26.1692993Z         PASS [   0.030s] ( 503/2567) spt::bin/spt rc::tests::harness_only_row_matches_online_seatless_live_agents_only
2026-08-18T01:05:26.1752226Z         PASS [   0.030s] ( 504/2567) spt::bin/spt rc::tests::identity_line_format
2026-08-18T01:05:26.1813860Z         PASS [   0.025s] ( 505/2567) spt::bin/spt rc::tests::key_event_step_detach_sm
2026-08-18T01:05:26.1844456Z         PASS [   0.024s] ( 506/2567) spt::bin/spt rc::tests::mouse_is_paste_only_right_button_down
2026-08-18T01:05:26.1889851Z         PASS [   0.024s] ( 507/2567) spt::bin/spt rc::tests::mouse_mode_decset_scan_survives_split_across_chunks
2026-08-18T01:05:26.1940861Z         PASS [   0.025s] ( 508/2567) spt::bin/spt rc::tests::mouse_mode_decset_scan_tracks_enable_and_sgr
2026-08-18T01:05:26.1989386Z         PASS [   0.024s] ( 509/2567) spt::bin/spt rc::tests::op_minter_distinct_and_monotonic
2026-08-18T01:05:26.2028449Z         PASS [   0.021s] ( 510/2567) spt::bin/spt rc::tests::pre_broker_busy_guidance_fires_for_any_driver_not_just_remote
2026-08-18T01:05:26.2077611Z         PASS [   0.023s] ( 511/2567) spt::bin/spt rc::tests::public_attach_failure_maps_deadline_class_only
2026-08-18T01:05:26.2112257Z         PASS [   0.022s] ( 512/2567) spt::bin/spt rc::tests::pump_status_emit_sequence_over_write_sink
2026-08-18T01:05:26.2606999Z         PASS [   0.066s] ( 513/2567) spt::bin/spt rc::tests::reassert_scanner_survives_split_across_chunks
2026-08-18T01:05:26.2645253Z         PASS [   0.066s] ( 514/2567) spt::bin/spt rc::tests::reassert_scanner_triggers_only_on_region_destroyers
2026-08-18T01:05:26.2687332Z         PASS [   0.066s] ( 515/2567) spt::bin/spt rc::tests::reconnect_banner_clears_and_centers
2026-08-18T01:05:26.2727664Z         PASS [   0.065s] ( 516/2567) spt::bin/spt rc::tests::reconnect_banner_shows_the_countdown
2026-08-18T01:05:26.2771758Z         PASS [   0.066s] ( 517/2567) spt::bin/spt rc::tests::reconnect_remaining_secs_counts_down_ceil
2026-08-18T01:05:26.2811374Z         PASS [   0.020s] ( 518/2567) spt::bin/spt rc::tests::reconnect_window_expiry_decision
2026-08-18T01:05:26.2853952Z         PASS [   0.021s] ( 519/2567) spt::bin/spt rc::tests::scroll_dir_classifies_wheel_only
2026-08-18T01:05:26.2892229Z         PASS [   0.020s] ( 520/2567) spt::bin/spt rc::tests::scroll_sgr_emits_exact_xterm_bytes
2026-08-18T01:05:26.2929867Z         PASS [   0.020s] ( 521/2567) spt::bin/spt rc::tests::serve_eof_severed_vs_refused
2026-08-18T01:05:26.2972867Z         PASS [   0.020s] ( 522/2567) spt::bin/spt rc::tests::status_assert_reserves_row1_then_repaints
2026-08-18T01:05:26.3014973Z         PASS [   0.020s] ( 523/2567) spt::bin/spt rc::tests::status_repaint_exact_bytes_and_right_align
2026-08-18T01:05:26.3061951Z         PASS [   0.021s] ( 524/2567) spt::bin/spt rc::tests::status_restore_exact_bytes
2026-08-18T01:05:26.3112306Z         PASS [   0.022s] ( 525/2567) spt::bin/spt rc::tests::status_row_marker_is_disabled_by_flag
2026-08-18T01:05:26.3156444Z         PASS [   0.023s] ( 526/2567) spt::bin/spt rc::tests::status_update_size_repoints_geometry
2026-08-18T01:05:26.3206393Z         PASS [   0.023s] ( 527/2567) spt::bin/spt rc::tests::teardown_matrix_postlude_precedes_prose_across_every_final_class
2026-08-18T01:05:26.3259965Z         PASS [   0.024s] ( 528/2567) spt::bin/spt rc::tests::the_client_refuses_engine_room_viewports_and_qualified_targets_only
2026-08-18T01:05:26.3290264Z         PASS [   0.023s] ( 529/2567) spt::bin/spt rc::tests::translate_key_event_emits_exact_xterm_vt
2026-08-18T01:05:26.3337922Z         PASS [   0.023s] ( 530/2567) spt::bin/spt rc::tests::with_vt_output_disables_newline_auto_return
2026-08-18T01:05:26.3379938Z         PASS [   0.022s] ( 531/2567) spt::bin/spt rc::tests::with_vt_output_enables_virtual_terminal_processing
2026-08-18T01:05:26.5003113Z         PASS [   0.440s] ( 532/2567) spt::bin/spt rc::tests::attach_against_stopped_daemon_never_spawns_and_exits_loud
2026-08-18T01:05:27.0448169Z         PASS [   0.715s] ( 533/2567) spt::bin/spt roster::tests::detect_self_id_endpoint_id_leg_is_label_only_and_perch_gated
2026-08-18T01:05:27.0470116Z         PASS [   0.977s] ( 534/2567) spt::bin/spt rc::tests::attach_offline_endpoint_short_circuits_clean
2026-08-18T01:05:27.0541706Z         PASS [   0.733s] ( 535/2567) spt::bin/spt roster::tests::detect_self_by_ancestry_none_when_no_ancestor_owns_a_perch
2026-08-18T01:05:27.0557574Z         PASS [   5.743s] ( 536/2567) spt::bin/spt cli::tests::adapter_translate_proof_gates_on_commit
2026-08-18T01:05:27.0560633Z         PASS [   0.718s] ( 537/2567) spt::bin/spt roster::tests::detect_self_resolves_spt_hosted_perch_via_parent_pid
2026-08-18T01:05:27.0582297Z         PASS [   0.724s] ( 538/2567) spt::bin/spt roster::tests::detect_self_id_resolves_identity_with_zero_git_spawns
2026-08-18T01:05:27.0643761Z         PASS [   0.945s] ( 539/2567) spt::bin/spt rc::tests::establish_attach_reuses_the_probes_carried_pump_conn
2026-08-18T01:05:27.0726298Z         PASS [   0.747s] ( 540/2567) spt::bin/spt roster::tests::detect_self_by_ancestry_resolves_a_live_ancestor_perch
2026-08-18T01:05:27.1091229Z         PASS [   0.609s] ( 541/2567) spt::bin/spt roster::tests::enumerate_nested_keeps_a_child_whose_name_has_no_kind_suffix
2026-08-18T01:05:27.1117466Z         PASS [   1.344s] ( 542/2567) spt::bin/spt api::startup::tests::establish_stamps_controllable_by_hosting_mode
2026-08-18T01:05:27.1645776Z         PASS [   0.120s] ( 543/2567) spt::bin/spt roster::tests::enumerate_yields_offline_corrupt_row_for_unparseable_info
2026-08-18T01:05:27.1851505Z         PASS [   0.129s] ( 544/2567) spt::bin/spt teardown::tests::an_unconfirmed_row_over_a_dead_root_is_stale_not_a_survivor
2026-08-18T01:05:27.1893773Z         PASS [   0.134s] ( 545/2567) spt::bin/spt roster::tests::match_self_by_ancestry_disambiguates_and_none
2026-08-18T01:05:27.1908263Z         PASS [   0.126s] ( 546/2567) spt::bin/spt teardown::tests::timeout_refuses_the_stamp_and_names_the_survivor
2026-08-18T01:05:27.1996593Z         PASS [   0.127s] ( 547/2567) spt::bin/spt teardown::tests::topology_gate_is_controllable_true_only
2026-08-18T01:05:27.2031109Z         PASS [   0.094s] ( 548/2567) spt::bin/spt tests::broken_pipe_panic_classifier
2026-08-18T01:05:27.2046424Z         PASS [   0.157s] ( 549/2567) spt::bin/spt roster::tests::list_all_perch_dirs_enumerates_nested_psyche_for_self_resolution
2026-08-18T01:05:27.2102660Z         PASS [   0.098s] ( 550/2567) spt::bin/spt api::startup::tests::fresh_bind_over_dead_life_needs_both_terminal_and_a_new_session
2026-08-18T01:05:27.2132957Z         PASS [   0.049s] ( 551/2567) spt::bin/spt tests::the_sized_stack_wrapper_maps_a_panic_to_the_main_thread_code
2026-08-18T01:05:27.2146114Z         PASS [   0.159s] ( 552/2567) spt::bin/spt roster::tests::parent_pid_candidates_stay_ancestry_gated
2026-08-18T01:05:27.2222681Z         PASS [   0.037s] ( 553/2567) spt::bin/spt trustwarnverb::tests::a_refusal_names_the_verb_the_endpoint_and_the_reason
2026-08-18T01:05:27.2265439Z         PASS [   0.038s] ( 554/2567) spt::bin/spt trustwarnverb::tests::showing_the_warning_is_never_elevation_gated
2026-08-18T01:05:27.2375569Z         PASS [   0.179s] ( 555/2567) spt::bin/spt teardown::tests::liveness_proof_needs_a_real_snapshot_and_finds_this_process
2026-08-18T01:05:27.2754377Z         PASS [   0.085s] ( 556/2567) spt::bin/spt trustwarnverb::tests::the_gate_keys_on_whether_the_verb_writes
2026-08-18T01:05:27.2811480Z         PASS [   0.082s] ( 557/2567) spt::bin/spt trustwarnverb::tests::writing_an_override_requires_confirmed_elevation
2026-08-18T01:05:27.2865085Z         PASS [   0.084s] ( 558/2567) spt::bin/spt unlisted::tests::a_cross_node_knock_says_answer_unknown_while_a_same_node_one_says_approved
2026-08-18T01:05:27.2910626Z         PASS [   0.086s] ( 559/2567) spt::bin/spt unlisted::tests::a_rule_only_row_has_no_node_to_route_to
2026-08-18T01:05:27.3017160Z         PASS [   0.088s] ( 560/2567) spt::bin/spt unlisted::tests::an_exclusion_and_an_unheard_of_id_are_different_refusals
2026-08-18T01:05:27.3074959Z         PASS [   0.093s] ( 561/2567) spt::bin/spt unlisted::tests::an_exclusion_outranks_the_strongest_evidence
2026-08-18T01:05:27.3113361Z         PASS [   0.089s] ( 562/2567) spt::bin/spt unlisted::tests::an_inbound_knock_is_never_read_as_our_own_outbound_act
2026-08-18T01:05:27.3178016Z         PASS [   0.091s] ( 563/2567) spt::bin/spt unlisted::tests::contact_evidence_outside_the_window_produces_no_row
2026-08-18T01:05:27.3234660Z         PASS [   0.086s] ( 564/2567) spt::bin/spt unlisted::tests::listed_local_and_excluded_rows_are_dropped_and_the_rest_survive
2026-08-18T01:05:27.3273295Z         PASS [   0.052s] ( 565/2567) spt::bin/spt unlisted::tests::no_evidence_phrase_claims_liveness
2026-08-18T01:05:27.3324365Z         PASS [   0.051s] ( 566/2567) spt::bin/spt unlisted::tests::no_knock_evidence_phrase_claims_liveness
2026-08-18T01:05:27.3370995Z         PASS [   0.051s] ( 567/2567) spt::bin/spt unlisted::tests::rule_evidence_carries_no_node_and_contact_evidence_does
2026-08-18T01:05:27.3416878Z         PASS [   0.051s] ( 568/2567) spt::bin/spt unlisted::tests::the_relative_stamp_is_coarse_and_has_no_zero_forms
2026-08-18T01:05:27.3460115Z         PASS [   0.044s] ( 569/2567) spt::bin/spt unlisted::tests::the_route_refuses_an_excluded_id_and_admits_a_non_excluded_one
2026-08-18T01:05:27.3510212Z         PASS [   0.043s] ( 570/2567) spt::bin/spt unlisted::tests::the_strongest_provenance_labels_the_row_and_a_weaker_one_supplies_the_node
2026-08-18T01:05:27.3621131Z         PASS [   0.044s] ( 571/2567) spt-daemon access::tests::a_sender_endpoint_rule_does_not_admit_a_fork
2026-08-18T01:05:27.3801059Z         PASS [   0.069s] ( 572/2567) spt-daemon access::tests::a_fork_grant_admits_fork_and_nothing_else_admits_fork
2026-08-18T01:05:27.3875825Z         PASS [   0.064s] ( 573/2567) spt-daemon access::tests::corrupt_store_degrades_closed_but_replies_survive
2026-08-18T01:05:27.3960324Z         PASS [   0.068s] ( 574/2567) spt-daemon access::tests::discover_gate_discloses_per_viewer
2026-08-18T01:05:27.3993342Z         PASS [   0.067s] ( 575/2567) spt-daemon access::tests::discover_gate_withholds_everything_while_degraded
2026-08-18T01:05:27.4062164Z         PASS [   0.064s] ( 576/2567) spt-daemon access::tests::gate_feeds_the_proven_sender_endpoint_tier
2026-08-18T01:05:27.4102628Z         PASS [   0.064s] ( 577/2567) spt-daemon access::tests::gate_is_per_surface
2026-08-18T01:05:27.4168457Z         PASS [   0.080s] ( 578/2567) spt-daemon access::tests::gate_decision_table
2026-08-18T01:05:27.4175790Z         PASS [   0.067s] ( 579/2567) spt-daemon access::tests::reply_passes_where_unsolicited_refused
2026-08-18T01:05:27.4374356Z         PASS [   0.075s] ( 580/2567) spt-daemon access::tests::same_node_always_passes_without_minting
2026-08-18T01:05:27.4655901Z         PASS [   0.255s] ( 581/2567) spt::bin/spt api::startup::tests::fresh_create_over_a_stopped_life_reads_active_with_no_wake
2026-08-18T01:05:27.4731881Z         PASS [   0.093s] ( 582/2567) spt-daemon access::tests::the_decision_helpers_split_pass_from_refusal_for_every_reason
2026-08-18T01:05:27.5036142Z         PASS [   0.104s] ( 583/2567) spt-daemon access::tests::the_inbound_lock_answers_replies_only_and_only_while_controlled
2026-08-18T01:05:27.5070534Z         PASS [   0.097s] ( 584/2567) spt-daemon access::tests::the_knock_exemption_hook_refuses_everything_today
2026-08-18T01:05:27.5097934Z         PASS [   0.114s] ( 585/2567) spt-daemon access::tests::the_engine_room_refuses_even_this_nodes_own_unsolicited_inbound
2026-08-18T01:05:27.5145981Z         PASS [   0.097s] ( 586/2567) spt-daemon access::tests::the_trust_warning_fires_only_for_an_entry_admitted_stranger
2026-08-18T01:05:27.5290036Z         PASS [   0.123s] ( 587/2567) spt-daemon access::tests::the_inbound_lock_is_reached_through_the_sender_stamped_entry_point
2026-08-18T01:05:27.5312052Z         PASS [   0.094s] ( 588/2567) spt-daemon access::tests::the_wire_origin_stamp_reaches_the_chain
2026-08-18T01:05:27.5390198Z         PASS [   0.035s] ( 589/2567) spt-daemon activity::tests::a_token_change_with_an_identical_state_owes_a_push
2026-08-18T01:05:27.5392599Z         PASS [   0.066s] ( 590/2567) spt-daemon activity::tests::a_state_change_owes_a_push_both_directions
2026-08-18T01:05:27.5423497Z         PASS [   0.035s] ( 591/2567) spt-daemon activity::tests::an_identical_observation_pushes_nothing
2026-08-18T01:05:27.5522535Z         PASS [   0.038s] ( 592/2567) spt-daemon activity::tests::an_unseen_link_owes_a_push
2026-08-18T01:05:27.5886073Z         PASS [   0.057s] ( 593/2567) spt-daemon activity::tests::observe_links_on_an_absent_owlery_is_empty
2026-08-18T01:05:27.5917942Z         PASS [   0.081s] ( 594/2567) spt-daemon activity::tests::an_owner_with_no_linked_shell_is_not_observed
2026-08-18T01:05:27.5958932Z         PASS [   0.067s] ( 595/2567) spt-daemon activity::tests::an_unstamped_owner_observes_undated_and_stays_silent_across_sweeps
2026-08-18T01:05:27.5976099Z         PASS [   0.181s] ( 596/2567) spt-daemon access::tests::the_pass_reason_names_which_arm_admitted_the_interaction
2026-08-18T01:05:27.5982570Z         PASS [   0.059s] ( 597/2567) spt-daemon activity::tests::remember_forgets_a_vanished_link_so_its_return_re_pushes
2026-08-18T01:05:27.6046949Z         PASS [   0.066s] ( 598/2567) spt-daemon activity::tests::observe_links_sees_only_online_shells_holding_a_token
2026-08-18T01:05:27.6050624Z         PASS [   0.063s] ( 599/2567) spt-daemon activity::tests::the_diff_is_per_link_not_per_owner
2026-08-18T01:05:27.6069575Z         PASS [   0.055s] ( 600/2567) spt-daemon activity::tests::the_flip_marker_is_idempotent_to_drop_and_taken_exactly_once
2026-08-18T01:05:27.6081986Z         PASS [   0.020s] ( 601/2567) spt-daemon adapter_update::tests::delegated_attested_delegates_command
2026-08-18T01:05:27.6110330Z         PASS [   0.019s] ( 602/2567) spt-daemon adapter_update::tests::delegated_unattested_is_skipped
2026-08-18T01:05:27.6415865Z         PASS [   0.254s] ( 603/2567) spt-daemon access::tests::the_engine_room_is_disclosed_only_to_the_viewers_it_chose
2026-08-18T01:05:27.6606396Z         PASS [   0.195s] ( 604/2567) spt::bin/spt api::startup::tests::fresh_create_with_no_prior_carries_no_rest_state
2026-08-18T01:05:27.6709969Z         PASS [   0.073s] ( 605/2567) spt-daemon adapter_update::tests::file_pull_without_payload_is_skipped
2026-08-18T01:05:27.6718608Z         PASS [   0.076s] ( 606/2567) spt-daemon adapter_update::tests::file_pull_tampered_bytes_rejected
2026-08-18T01:05:27.6752872Z         PASS [   0.078s] ( 607/2567) spt-daemon adapter_update::tests::file_pull_verified_against_adapter_key
2026-08-18T01:05:27.6802329Z         PASS [   0.075s] ( 608/2567) spt-daemon adapter_update::tests::gh_release_is_managed_cli_side_not_in_pure_plan
2026-08-18T01:05:27.6842134Z         PASS [   0.079s] ( 609/2567) spt-daemon adapter_update::tests::file_pull_wrong_key_rejected
2026-08-18T01:05:27.6946390Z         PASS [   0.088s] ( 610/2567) spt-daemon adapter_update::tests::ripple_conducts_each_adapter_in_order
2026-08-18T01:05:27.7072808Z         PASS [   0.046s] ( 611/2567) spt::bin/spt api::startup::tests::listen_never_asserts_hosting_topology_and_bind_still_does
2026-08-18T01:05:27.7097062Z         PASS [   2.929s] ( 612/2567) spt::bin/spt cli::tests::the_monic_command_path_treats_a_husk_as_present
2026-08-18T01:05:27.7249855Z         PASS [   0.050s] ( 613/2567) spt-daemon attach::tests::the_engine_room_has_no_viewport_and_takes_its_controls_from_home
2026-08-18T01:05:27.7277809Z         PASS [   0.056s] ( 614/2567) spt-daemon answerop::tests::an_unknown_outcome_token_acts_on_nothing
2026-08-18T01:05:27.7351303Z         PASS [   0.055s] ( 615/2567) spt-daemon attach::tests::viewer_and_driving_intents_gate_on_different_surfaces
2026-08-18T01:05:27.7400079Z         PASS [   0.132s] ( 616/2567) spt-daemon adapter_update::tests::ripple_registered_uses_the_registered_set
2026-08-18T01:05:27.7491851Z         PASS [   0.054s] ( 617/2567) spt-daemon autostart::tests::empty_config_is_a_pure_noop
2026-08-18T01:05:27.7501779Z         PASS [   0.043s] ( 618/2567) spt::bin/spt api::startup::tests::listen_online_gate_refuses_capability_only_online
2026-08-18T01:05:27.7706218Z         PASS [   0.060s] ( 619/2567) spt-daemon autostart::tests::unresolved_adapter_loud_skips_before_any_launch
2026-08-18T01:05:27.7780194Z         PASS [   0.050s] ( 620/2567) spt-daemon brain::tests::an_old_broker_wire_without_the_sync_key_keeps_every_legacy_path
2026-08-18T01:05:27.7783584Z         PASS [   0.053s] ( 621/2567) spt-daemon brain::tests::a_flagged_sync_frame_baselines_forward_never_backward_on_both_paths
2026-08-18T01:05:27.7793614Z         PASS [   0.044s] ( 622/2567) spt-daemon brain::tests::cold_brain_still_rejects_a_forward_output_gap
2026-08-18T01:05:27.7901913Z         PASS [   0.179s] ( 623/2567) spt-daemon answerop::tests::a_denial_disarms_but_only_when_it_is_proven
2026-08-18T01:05:27.7904484Z         PASS [   0.042s] ( 624/2567) spt-daemon brain::tests::peer_reply_deadline_caps_below_carrier_deadline
2026-08-18T01:05:27.7926257Z         PASS [   0.052s] ( 625/2567) spt-daemon brain::tests::controller_resume_from_floor_refetches_after_a_gap
2026-08-18T01:05:27.8270383Z         PASS [   0.185s] ( 626/2567) spt-daemon answerop::tests::a_receipt_fires_only_from_the_node_the_knock_was_sent_to
2026-08-18T01:05:27.8328637Z         PASS [   0.162s] ( 627/2567) spt-daemon answerop::tests::a_receipt_from_the_wrong_answerer_or_a_replayed_one_acts_on_nothing
2026-08-18T01:05:27.8381789Z         PASS [   0.088s] ( 628/2567) spt::bin/spt api::startup::tests::listen_orphan_exit_line_names_self_and_parent
2026-08-18T01:05:27.8422981Z         PASS [   0.072s] ( 629/2567) spt-daemon brain::tests::reclassify_peer_reply_maps_timeout_off_poison
2026-08-18T01:05:27.8495108Z         PASS [   0.071s] ( 630/2567) spt-daemon brain::tests::skip_to_live_accepts_a_forward_seq_jump_via_snap_above
2026-08-18T01:05:27.8535984Z         PASS [   0.075s] ( 631/2567) spt-daemon brain::tests::viewer_snap_attach_accepts_a_forward_output_gap
2026-08-18T01:05:27.8571223Z         PASS [   0.078s] ( 632/2567) spt-daemon brainproc::tests::appended_padding_flips_exe_hash
2026-08-18T01:05:27.8623830Z         PASS [   0.072s] ( 633/2567) spt-daemon brainproc::tests::backoff_doubles_on_fast_death_resets_when_healthy
2026-08-18T01:05:27.8668334Z         PASS [   0.076s] ( 634/2567) spt-daemon brainproc::tests::brain_child_args_carry_generation_and_reason
2026-08-18T01:05:27.8715133Z         PASS [   0.079s] ( 635/2567) spt-daemon brainproc::tests::bytes_gate_truth_table
2026-08-18T01:05:27.8795514Z         PASS [   6.800s] ( 636/2567) spt::bin/spt cli::tests::a_remote_fork_refuses_delete_source_whole_rather_than_trimming_it
2026-08-18T01:05:27.8817003Z         PASS [   0.049s] ( 637/2567) spt-daemon brainproc::tests::consumer_gate_spawns_once_when_net_enabled
2026-08-18T01:05:27.9099078Z         PASS [   0.060s] ( 638/2567) spt-daemon brainproc::tests::planned_restart_respawns_with_update_reason
2026-08-18T01:05:27.9230801Z         PASS [   0.085s] ( 639/2567) spt::bin/spt api::startup::tests::live_perch_under_other_session_conflicts
2026-08-18T01:05:27.9314588Z         PASS [   0.065s] ( 640/2567) spt-daemon brainproc::tests::ready_exe_hash_parses_and_is_n1_readable
2026-08-18T01:05:27.9354257Z         PASS [   0.078s] ( 641/2567) spt-daemon brainproc::tests::ready_but_wrong_bytes_rolls_back_never_promotes
2026-08-18T01:05:27.9419817Z         PASS [   0.062s] ( 642/2567) spt-daemon brainproc::tests::ready_generation_parses_stamp_and_fails_safe
2026-08-18T01:05:27.9440508Z         PASS [   0.072s] ( 643/2567) spt-daemon brainproc::tests::ready_generation_at_reads_file_and_absent_is_none
2026-08-18T01:05:27.9565712Z         PASS [   5.804s] ( 644/2567) spt::bin/spt cli::tests::fork_forks_homes_and_deletes_exactly_the_source
2026-08-18T01:05:27.9952019Z         PASS [   0.085s] ( 645/2567) spt-daemon brainproc::tests::rollback_running_version_is_prior_not_n_minus_one
2026-08-18T01:05:28.0072303Z         PASS [   0.084s] ( 646/2567) spt::bin/spt api::startup::tests::missing_seed_refused
2026-08-18T01:05:28.0099638Z         PASS [   0.074s] ( 647/2567) spt-daemon brainproc::tests::select_brain_exe_prefers_canonical_over_per_spawn_current_exe
2026-08-18T01:05:28.0170710Z         PASS [   0.086s] ( 648/2567) spt-daemon brainproc::tests::rolled_back_record_spawns_rollback_binary_on_a_fresh_supervisor
2026-08-18T01:05:28.0242525Z         PASS [   0.080s] ( 649/2567) spt-daemon brainproc::tests::start_reason_arg_round_trips_and_is_lenient
2026-08-18T01:05:28.0668218Z         PASS [   0.059s] ( 650/2567) spt::bin/spt api::startup::tests::no_seed_is_the_fallback_trigger_then_sid_binds
2026-08-18T01:05:28.1108420Z         PASS [   0.044s] ( 651/2567) spt::bin/spt api::startup::tests::only_an_unverified_refusal_names_its_escape
2026-08-18T01:05:28.1524264Z         PASS [   0.290s] ( 652/2567) spt-daemon brainproc::tests::ready_candidate_promotes_once_old_gen_drains
2026-08-18T01:05:28.1664325Z         PASS [   0.056s] ( 653/2567) spt::bin/spt api::startup::tests::only_gone_changes_the_conflict_verdict
2026-08-18T01:05:28.1694384Z         PASS [   0.017s] ( 654/2567) spt-daemon codec::tests::back_to_back_frames_decode_independently
2026-08-18T01:05:28.1850447Z         PASS [   0.016s] ( 655/2567) spt-daemon codec::tests::frame_round_trips_through_buffer
2026-08-18T01:05:28.1967930Z         PASS [   0.030s] ( 656/2567) spt::bin/spt api::startup::tests::parent_watchdog_triggers_exit_on_a_dead_parent_only
2026-08-18T01:05:28.1995402Z         PASS [   0.014s] ( 657/2567) spt-daemon codec::tests::oversized_prefix_rejected
2026-08-18T01:05:28.2138928Z         PASS [   0.332s] ( 658/2567) spt-daemon brainproc::tests::ready_with_matching_bytes_promotes
2026-08-18T01:05:28.2228465Z         PASS [   0.023s] ( 659/2567) spt-daemon config::tests::auto_suspend_knob_is_opt_in_default_off
2026-08-18T01:05:28.2374455Z         PASS [   0.023s] ( 660/2567) spt-daemon config::tests::crash_grace_is_config_driven
2026-08-18T01:05:28.2404834Z         PASS [   0.018s] ( 661/2567) spt-daemon config::tests::detached_subnets_knob_defaults_empty
2026-08-18T01:05:28.2623966Z         PASS [   0.025s] ( 662/2567) spt-daemon config::tests::full_auto_update_is_gated_by_default
2026-08-18T01:05:28.2624523Z         PASS [   0.022s] ( 663/2567) spt-daemon config::tests::malformed_file_degrades_to_default
2026-08-18T01:05:28.2984588Z         PASS [   0.102s] ( 664/2567) spt::bin/spt api::startup::tests::post_spawn_bind_establishes_perch
2026-08-18T01:05:28.3064375Z         PASS [   0.289s] ( 665/2567) spt-daemon brainproc::tests::trial_promotes_on_ready_then_supervises_the_accepted_binary
2026-08-18T01:05:28.3213988Z         PASS [   0.059s] ( 666/2567) spt-daemon config::tests::missing_file_is_default
2026-08-18T01:05:28.3256629Z         PASS [   0.063s] ( 667/2567) spt-daemon config::tests::pulse_period_is_config_driven
2026-08-18T01:05:28.3466941Z         PASS [   0.040s] ( 668/2567) spt-daemon config::tests::relay_choice_is_config_driven
2026-08-18T01:05:28.3526626Z         PASS [   0.027s] ( 669/2567) spt-daemon config::tests::save_load_roundtrip
2026-08-18T01:05:28.3708959Z         LEAK [   0.544s] ( 670/2567) spt-daemon brainproc::tests::clear_before_spawn_defeats_exact_generation_stale_file
2026-08-18T01:05:28.3711994Z         LEAK [   0.517s] ( 671/2567) spt-daemon brainproc::tests::ready_but_old_gen_never_drains_does_not_promote_rolls_back
2026-08-18T01:05:28.3809535Z         PASS [   0.059s] ( 672/2567) spt-daemon config::tests::remove_startup_endpoint_takes_one_entry_and_reports_whether_there_was_one
2026-08-18T01:05:28.4062689Z         PASS [   0.107s] ( 673/2567) spt::bin/spt api::startup::tests::prebind_refusal_restores_the_seed_for_retry
2026-08-18T01:05:28.4285165Z         PASS [   0.057s] ( 674/2567) spt-daemon conn::tests::conn_ids_are_unique_and_labels_stay_bounded
2026-08-18T01:05:28.4378016Z         PASS [   0.057s] ( 675/2567) spt-daemon conn::tests::retirement_token_splits_deadline_from_organic_with_attribution_parity
2026-08-18T01:05:28.4383983Z         PASS [   0.068s] ( 676/2567) spt-daemon conn::tests::organic_write_failure_still_poisons_and_is_not_the_timeout_class
2026-08-18T01:05:28.4404026Z         PASS [   0.034s] ( 677/2567) spt::bin/spt api::startup::tests::read_env_measured_capture_replaces_prior_stamp
2026-08-18T01:05:28.4457939Z         PASS [   0.099s] ( 678/2567) spt-daemon config::tests::startup_endpoints_roundtrip
2026-08-18T01:05:28.4599262Z         PASS [   0.107s] ( 679/2567) spt-daemon config::tests::upsert_startup_endpoint_appends_then_replaces_preserving_other_knobs
2026-08-18T01:05:28.4959785Z         PASS [   0.067s] ( 680/2567) spt-daemon consent::tests::decide_honors_full_auto_flag
2026-08-18T01:05:28.5423766Z         PASS [   0.547s] ( 681/2567) spt-daemon brainproc::tests::supervisor_respawns_brain_until_stopped
2026-08-18T01:05:28.5488487Z         PASS [   0.592s] ( 682/2567) spt-daemon brainproc::tests::supervisor_owns_generation_and_stamps_start_reason
2026-08-18T01:05:28.5489316Z         PASS [   0.103s] ( 683/2567) spt-daemon crc_swap::tests::apply_rollback_never_strands
2026-08-18T01:05:28.5656732Z         PASS [   0.070s] ( 684/2567) spt-daemon crc_swap::tests::crash_recovery_missing_target_keeps_last_good_old
2026-08-18T01:05:28.5674238Z         PASS [   0.130s] ( 685/2567) spt-daemon consent::tests::no_live_session_resolves_to_none
2026-08-18T01:05:28.5740415Z         PASS [   0.114s] ( 686/2567) spt-daemon crc_swap::tests::apply_swaps_changed_creates_new_untouched_identical
2026-08-18T01:05:28.5861560Z         PASS [   0.044s] ( 687/2567) spt-daemon crc_swap::tests::displace_picks_fresh_old_name_and_gc_sweeps_stale
2026-08-18T01:05:28.5912613Z         PASS [   5.526s] ( 688/2567) spt::bin/spt cli::tests::purge_removes_every_record
2026-08-18T01:05:28.6044442Z         PASS [   0.055s] ( 689/2567) spt-daemon crc_swap::tests::plan_recurses_nested_dirs
2026-08-18T01:05:28.6068760Z         PASS [   0.033s] ( 690/2567) spt-daemon daemon::tests::a_captured_spawn_inherits_only_the_handle_in_its_allowlist
2026-08-18T01:05:28.6070526Z         PASS [   0.040s] ( 691/2567) spt-daemon crc_swap::tests::swap_error_carries_op_and_paths
2026-08-18T01:05:28.6251282Z         PASS [   0.059s] ( 692/2567) spt-daemon crc_swap::tests::plan_selects_only_changed
2026-08-18T01:05:28.6541506Z         PASS [   0.068s] ( 693/2567) spt-daemon daemon::tests::a_failed_job_termination_announces_the_tree_loss
2026-08-18T01:05:28.6838721Z         PASS [   0.245s] ( 694/2567) spt-daemon consent::tests::resolves_most_recently_active_live_session
2026-08-18T01:05:28.6964217Z         PASS [   0.089s] ( 695/2567) spt-daemon daemon::tests::an_ordinary_teardown_announces_nothing
2026-08-18T01:05:28.7017801Z         PASS [   0.260s] ( 696/2567) spt::bin/spt api::startup::tests::rebind_same_session_ok
2026-08-18T01:05:28.7050579Z         PASS [   0.114s] ( 697/2567) spt-daemon daemon::tests::a_scrubbed_variable_never_reaches_the_child
2026-08-18T01:05:28.7051510Z         LEAK [   0.763s] ( 698/2567) spt-daemon brainproc::tests::stale_generation_minus_one_ready_never_promotes
2026-08-18T01:05:28.7055247Z         LEAK [   0.695s] ( 699/2567) spt-daemon brainproc::tests::trial_kills_alive_never_ready_candidate_before_rollback
2026-08-18T01:05:28.7305942Z         PASS [   0.076s] ( 700/2567) spt-daemon daemon::tests::drive_ladder_all_err_returns_last_err
2026-08-18T01:05:28.7499644Z         PASS [   0.054s] ( 701/2567) spt-daemon daemon::tests::drive_ladder_picks_first_ok_rung
2026-08-18T01:05:28.7510733Z         PASS [   0.046s] ( 702/2567) spt-daemon daemon::tests::ensure_declines_only_against_a_standing_operator_stop
2026-08-18T01:05:28.7534999Z         PASS [   0.069s] ( 703/2567) spt-daemon daemon::tests::drive_ladder_falls_through_to_next_rung_on_err
2026-08-18T01:05:28.7624499Z         PASS [   0.057s] ( 704/2567) spt-daemon daemon::tests::implicit_ensure_declines_without_clearing_the_inhibit
2026-08-18T01:05:28.7629936Z         PASS [   0.033s] ( 705/2567) spt-daemon daemon::tests::launch_ladder_order_is_wmi_schtasks_breakaway_injob
2026-08-18T01:05:28.7705599Z         PASS [   0.064s] ( 706/2567) spt-daemon daemon::tests::is_running_tracks_the_seed_channel
2026-08-18T01:05:28.7710565Z         PASS [   0.021s] ( 707/2567) spt-daemon daemon::tests::net_retry_backoff_doubles_then_caps
2026-08-18T01:05:28.7762302Z         PASS [   0.025s] ( 708/2567) spt-daemon daemon::tests::null_std_handles_only_on_a_pipe_stderr
2026-08-18T01:05:28.7875643Z         PASS [   0.239s] ( 709/2567) spt-daemon crc_swap::tests::mapped_old_does_not_brick_apply_displaces_aside
2026-08-18T01:05:28.8159446Z         PASS [   0.792s] ( 710/2567) spt-daemon brainproc::tests::trial_rolls_back_after_budget_of_pre_ready_exits
2026-08-18T01:05:28.8378200Z         PASS [   0.075s] ( 711/2567) spt-daemon daemon::tests::the_refusal_line_names_the_remedy
2026-08-18T01:05:28.8484374Z         PASS [   0.086s] ( 712/2567) spt-daemon daemon::tests::the_tree_loss_line_names_the_loss_not_the_syscall
2026-08-18T01:05:28.8611848Z         PASS [   0.089s] ( 713/2567) spt-daemon daemon::tests::windows_arg_quoting_roundtrips_the_rules
2026-08-18T01:05:28.8877740Z         PASS [   0.187s] ( 714/2567) spt::bin/spt api::startup::tests::revive_preserves_prior_rest_state_and_dormant_anchor
2026-08-18T01:05:28.8917004Z         PASS [   0.115s] ( 715/2567) spt-daemon deadline::tests::advance_after_fire_steps_one_grid_normally_and_collapses_a_stall
2026-08-18T01:05:28.9190909Z         PASS [   0.131s] ( 716/2567) spt-daemon deadline::tests::cold_and_crash_write_fresh_anchor_at_now
2026-08-18T01:05:28.9193281Z         PASS [   0.148s] ( 717/2567) spt-daemon daemon::tests::wmi_create_script_carries_the_no_window_startup_spec
2026-08-18T01:05:28.9208250Z         PASS [   0.168s] ( 718/2567) spt-daemon daemon::tests::spawn_env_additions_reach_the_child_and_keep_the_inherited_environment
2026-08-18T01:05:28.9276186Z         PASS [   0.302s] ( 719/2567) spt-daemon daemon::tests::detached_no_inherit_falls_back_under_a_breakaway_denying_job
2026-08-18T01:05:28.9323608Z         PASS [   0.095s] ( 720/2567) spt-daemon deadline::tests::distinct_keys_do_not_cross_clobber
2026-08-18T01:05:28.9340361Z         PASS [   0.086s] ( 721/2567) spt-daemon deadline::tests::next_fire_between_grid_points_rounds_up
2026-08-18T01:05:28.9427366Z         PASS [   0.084s] ( 722/2567) spt-daemon deadline::tests::next_fire_long_jump_collapses_missed_ticks_to_one
2026-08-18T01:05:28.9455504Z         PASS [   0.054s] ( 723/2567) spt-daemon deadline::tests::next_fire_on_grid_returns_now_and_advances_strictly
2026-08-18T01:05:28.9481104Z         PASS [   0.132s] ( 724/2567) spt-daemon deadline::tests::corrupt_file_degrades_to_fresh
2026-08-18T01:05:28.9512554Z         PASS [   0.033s] ( 725/2567) spt-daemon deadline::tests::next_fire_saturates_when_now_precedes_anchor
2026-08-18T01:05:28.9852814Z         PASS [   0.377s] ( 726/2567) spt-daemon daemon::tests::breakaway_spawn_escapes_a_kill_on_close_job
2026-08-18T01:05:28.9970292Z         PASS [   0.078s] ( 727/2567) spt-daemon deadline::tests::one_shot_fires_at_or_after_target_and_never_resets
2026-08-18T01:05:29.0540426Z         PASS [   0.133s] ( 728/2567) spt-daemon deadline::tests::update_keeps_anchor_and_refreshes_interval
2026-08-18T01:05:29.0713326Z         PASS [   0.137s] ( 729/2567) spt-daemon deelevate::tests::env_overlay_keeps_explicit_spt_home_alive
2026-08-18T01:05:29.0747182Z         PASS [   0.146s] ( 730/2567) spt-daemon deadline::tests::update_with_no_file_falls_back_fresh
2026-08-18T01:05:29.0755010Z         PASS [   0.188s] ( 731/2567) spt::bin/spt api::startup::tests::revive_without_cwd_preserves_prior_cwd
2026-08-18T01:05:29.0783850Z         PASS [   0.474s] ( 732/2567) spt-daemon daemon::tests::a_tree_teardown_reaches_a_grandchild_the_service_spawned
2026-08-18T01:05:29.0807195Z         PASS [   0.135s] ( 733/2567) spt-daemon digest::tests::common_prefix_len_finds_the_unchanged_head
2026-08-18T01:05:29.0904867Z         PASS [   0.158s] ( 734/2567) spt-daemon deadline::tests::zero_interval_degrades_to_config_default
2026-08-18T01:05:29.0943816Z         PASS [   0.152s] ( 735/2567) spt-daemon deelevate::tests::plan_spawn_deelevates_only_with_a_target
2026-08-18T01:05:29.1018611Z         PASS [   0.118s] ( 736/2567) spt-daemon digest::tests::merge_by_ts_interleaves_context
2026-08-18T01:05:29.1019215Z         PASS [   0.031s] ( 737/2567) spt-daemon digest::tests::resolve_config_precedence
2026-08-18T01:05:29.1026823Z         PASS [   0.049s] ( 738/2567) spt-daemon digest::tests::projects_empty_for_a_sourceless_endpoint
2026-08-18T01:05:29.1057509Z         PASS [   0.032s] ( 739/2567) spt-daemon digest::tests::supersede_collapses_cross_generation_replay_to_newest
2026-08-18T01:05:29.1209159Z         PASS [   0.170s] ( 740/2567) spt-daemon digest::tests::log_less_two_origin_merge_interleaves_by_ts
2026-08-18T01:05:29.1211122Z         PASS [   0.124s] ( 741/2567) spt-daemon digest::tests::projects_a_log_less_endpoint_from_digest_log
2026-08-18T01:05:29.1331250Z         PASS [   0.058s] ( 742/2567) spt::bin/spt api::startup::tests::seed_bind_records_seed_captured_cwd
2026-08-18T01:05:29.1530518Z         PASS [   0.075s] ( 743/2567) spt-daemon digest::tests::supersede_is_noop_on_disjoint_sessions
2026-08-18T01:05:29.1586869Z         PASS [   0.078s] ( 744/2567) spt-daemon digest::tests::supersede_keeps_within_generation_repeats
2026-08-18T01:05:29.1639652Z         PASS [   0.074s] ( 745/2567) spt-daemon digest::tests::supersede_trims_divider_around_emptied_middle_generation
2026-08-18T01:05:29.1973366Z         PASS [   0.102s] ( 746/2567) spt-daemon digesthub::tests::dropped_subscriber_is_pruned
2026-08-18T01:05:29.2125023Z         PASS [   0.110s] ( 747/2567) spt-daemon digesthub::tests::project_and_publish_stores_latest
2026-08-18T01:05:29.2964066Z         PASS [   1.611s] ( 748/2567) spt-daemon autostart::tests::a_persisted_reserved_id_default_is_never_replayed
2026-08-18T01:05:29.3148333Z         PASS [   0.193s] ( 749/2567) spt-daemon dispatch::tests::a_fork_record_is_never_read_as_a_message_and_an_old_daemon_drops_it
2026-08-18T01:05:29.3254134Z         PASS [   0.223s] ( 750/2567) spt-daemon digesthub::tests::publish_delta_is_tail_then_full_refresh
2026-08-18T01:05:29.3353639Z         PASS [   0.182s] ( 751/2567) spt-daemon dispatch::tests::a_presence_record_classifies_as_its_own_family_and_never_as_a_message
2026-08-18T01:05:29.3355547Z         PASS [   0.232s] ( 752/2567) spt-daemon digesthub::tests::render_is_glanceable
2026-08-18T01:05:29.3361192Z         PASS [   0.177s] ( 753/2567) spt-daemon dispatch::tests::a_receipt_is_never_read_as_a_message_and_never_as_a_knock
2026-08-18T01:05:29.3386358Z         PASS [   0.174s] ( 754/2567) spt-daemon dispatch::tests::a_redemption_is_dropped_by_an_old_daemon_where_a_knock_field_would_have_been_accepted
2026-08-18T01:05:29.3421772Z         PASS [   0.221s] ( 755/2567) spt-daemon dispatch::tests::a_knock_record_routes_here_and_drops_cleanly_on_an_n1_daemon
2026-08-18T01:05:29.3444096Z         PASS [   0.239s] ( 756/2567) spt-daemon digesthub::tests::subscribe_returns_current_base
2026-08-18T01:05:29.3446109Z         PASS [   0.211s] ( 757/2567) spt::bin/spt api::startup::tests::seed_fail_eof_gives_actionable_stale_broker_hint
2026-08-18T01:05:29.3479518Z         PASS [   0.052s] ( 758/2567) spt-daemon dispatch::tests::breaker_trips_with_doubling_capped_window_and_resets_on_progress
2026-08-18T01:05:29.3997688Z         PASS [   0.085s] ( 759/2567) spt-daemon dispatch::tests::classifies_every_family_by_first_line_shape
2026-08-18T01:05:29.4053581Z         PASS [   0.080s] ( 760/2567) spt-daemon dispatch::tests::classify_failure_seat_blocked_is_exactly_the_three_discipline_strings
2026-08-18T01:05:29.4119330Z         PASS [   0.077s] ( 761/2567) spt-daemon dispatch::tests::cold_enumeration_claims_at_most_the_pool_bound_per_poll
2026-08-18T01:05:29.4125530Z         PASS [   0.077s] ( 762/2567) spt-daemon dispatch::tests::digest_pull_and_rest_never_read_as_each_other
2026-08-18T01:05:29.4139872Z         PASS [   0.075s] ( 763/2567) spt-daemon dispatch::tests::each_presence_word_has_exactly_one_authority
2026-08-18T01:05:29.4150448Z         PASS [   0.079s] ( 764/2567) spt-daemon dispatch::tests::dispatch_event_carries_the_complete_key_set
2026-08-18T01:05:29.4189547Z         PASS [   0.077s] ( 765/2567) spt-daemon dispatch::tests::feed_accumulator_commits_per_bound_never_per_chunk
2026-08-18T01:05:29.4238839Z         PASS [   0.212s] ( 766/2567) spt-daemon dispatch::tests::an_unadmitted_asker_is_refused_at_this_nodes_own_seam
2026-08-18T01:05:29.4244283Z         PASS [   0.080s] ( 767/2567) spt-daemon dispatch::tests::finished_is_terminal_for_attach_only
2026-08-18T01:05:29.4326358Z         PASS [   0.088s] ( 768/2567) spt::bin/spt api::startup::tests::seed_restorable_spends_dead_seeds_restores_recoverable
2026-08-18T01:05:29.4358516Z         PASS [   0.088s] ( 769/2567) spt-daemon dispatch::tests::line_endpoint_resolves_each_family_identity_key
2026-08-18T01:05:29.4398920Z         PASS [   0.041s] ( 770/2567) spt-daemon dispatch::tests::oneway_seatblocked_strikes_out_terminal_while_request_reply_paces_forever
2026-08-18T01:05:29.4578597Z         PASS [   0.510s] ( 771/2567) spt-daemon digest::tests::extractor_spans_sessions_with_a_boundary_marker
2026-08-18T01:05:29.4926654Z         PASS [   0.087s] ( 772/2567) spt-daemon dispatch::tests::only_the_old_broker_unknown_verb_answer_falls_back_to_the_peek
2026-08-18T01:05:29.4961815Z         PASS [   0.084s] ( 773/2567) spt-daemon dispatch::tests::seat_blocked_requeues_budget_free_paced_by_the_breaker_window
2026-08-18T01:05:29.5023785Z         PASS [   0.090s] ( 774/2567) spt-daemon dispatch::tests::the_family_census_is_bijective_with_the_enum
2026-08-18T01:05:29.5059293Z         PASS [   0.092s] ( 775/2567) spt-daemon dispatch::tests::the_family_census_knows_about_the_answer_receipt
2026-08-18T01:05:29.5227097Z         PASS [   0.099s] ( 776/2567) spt-daemon dispatch::tests::transient_failure_requeues_bounded_and_terminal_never_reenters
2026-08-18T01:05:29.5246776Z         PASS [   0.328s] ( 777/2567) spt-daemon dispatch::tests::a_served_probe_leaves_the_targets_spool_and_inbox_byte_identical
2026-08-18T01:05:29.5292105Z         PASS [   0.105s] ( 778/2567) spt-daemon dispatch::tests::unknown_shapes_refuse_classification
2026-08-18T01:05:29.5394819Z         PASS [   0.104s] ( 779/2567) spt-daemon docshost::tests::content_types_cover_the_bundle_classes
2026-08-18T01:05:29.5491705Z         PASS [   0.108s] ( 780/2567) spt-daemon docshost::tests::port_resolution_env_config_default
2026-08-18T01:05:29.5594759Z         PASS [   0.127s] ( 781/2567) spt::bin/spt api::startup::tests::session_id_fallback_binds_live_perch_from_sid
2026-08-18T01:05:29.5613047Z         PASS [   0.103s] ( 782/2567) spt-daemon docshost::tests::sanitizer_admits_pages_and_rejects_escapes
2026-08-18T01:05:29.5701349Z         PASS [   0.077s] ( 783/2567) spt-daemon drivehub::tests::a_following_op_is_served_when_nothing_refused
2026-08-18T01:05:29.5738019Z         PASS [   0.077s] ( 784/2567) spt-daemon drivehub::tests::a_foreign_owlery_is_refused_pre_ack_under_its_own_name
2026-08-18T01:05:29.5782678Z         PASS [   0.076s] ( 785/2567) spt-daemon drivehub::tests::activity_and_drive_never_clobber_each_other
2026-08-18T01:05:29.5813182Z         PASS [   0.075s] ( 786/2567) spt-daemon drivehub::tests::activity_take_is_latest_wins_and_exactly_once
2026-08-18T01:05:29.5858335Z         PASS [   0.063s] ( 787/2567) spt-daemon drivehub::tests::an_unknown_op_hangs_up_instead_of_being_swallowed
2026-08-18T01:05:29.5895994Z         PASS [   0.065s] ( 788/2567) spt-daemon drivehub::tests::clear_evicts_both_classes
2026-08-18T01:05:29.5957461Z         PASS [   0.066s] ( 789/2567) spt-daemon drivehub::tests::clear_evicts_the_slot
2026-08-18T01:05:29.5996235Z         PASS [   0.060s] ( 790/2567) spt-daemon drivehub::tests::dead_generation_activity_frame_is_never_served
2026-08-18T01:05:29.6023054Z         PASS [   0.187s] ( 791/2567) spt-daemon dispatch::tests::the_receiver_decides_origin_and_flood_not_the_sender
2026-08-18T01:05:29.6043090Z         PASS [   0.056s] ( 792/2567) spt-daemon drivehub::tests::dead_generation_frame_is_never_served
2026-08-18T01:05:29.6154746Z         PASS [   0.054s] ( 793/2567) spt-daemon drivehub::tests::drive_result_activity_key_is_additive_on_the_wire
2026-08-18T01:05:29.6212361Z         PASS [   0.051s] ( 794/2567) spt-daemon drivehub::tests::only_a_pre_ack_refusal_permits_a_second_spawn
2026-08-18T01:05:29.6270877Z         PASS [   0.068s] ( 795/2567) spt::bin/spt api::startup::tests::session_id_fallback_refuses_a_psyche_custody_sid
2026-08-18T01:05:29.6272998Z         PASS [   0.054s] ( 796/2567) spt-daemon drivehub::tests::slots_are_per_owner
2026-08-18T01:05:29.6304027Z         PASS [   0.052s] ( 797/2567) spt-daemon drivehub::tests::take_is_exactly_once
2026-08-18T01:05:29.6352765Z         PASS [   0.054s] ( 798/2567) spt-daemon drivehub::tests::the_launch_reply_shapes_round_trip
2026-08-18T01:05:29.6455379Z         PASS [   0.056s] ( 799/2567) spt-daemon drivehub::tests::write_is_latest_wins
2026-08-18T01:05:29.6707015Z         PASS [   0.075s] ( 800/2567) spt-daemon effect::tests::applied_set_survives_reopen
2026-08-18T01:05:29.7149030Z         PASS [   0.114s] ( 801/2567) spt-daemon effect::tests::apply_once_does_not_hold_the_journal_lock_across_effect
2026-08-18T01:05:29.7380225Z         PASS [   0.024s] ( 802/2567) spt-daemon effect::tests::second_apply_for_same_key_is_deduped
2026-08-18T01:05:29.7433258Z         PASS [   0.116s] ( 803/2567) spt::bin/spt api::startup::tests::session_id_fallback_refuses_empty_sid_and_dead_anchor
2026-08-18T01:05:29.7436009Z         PASS [   0.116s] ( 804/2567) spt-daemon effect::tests::minter_tag_round_trips
2026-08-18T01:05:29.7518444Z         PASS [   0.121s] ( 805/2567) spt-daemon effect::tests::open_creates_missing_parent_dirs
2026-08-18T01:05:29.7700536Z         PASS [   0.149s] ( 806/2567) spt-daemon effect::tests::marker_is_single_source_and_frozen
2026-08-18T01:05:29.7844401Z         PASS [   0.180s] ( 807/2567) spt-daemon effect::tests::failed_effect_is_not_recorded_applied
2026-08-18T01:05:29.7945504Z         PASS [   0.159s] ( 808/2567) spt-daemon effect::tests::poisoned_journal_lock_still_applies_subsequent_ops
2026-08-18T01:05:29.8167560Z         PASS [   0.073s] ( 809/2567) spt-daemon effect::tests::with_tracing_retry_no_retry_on_success
2026-08-18T01:05:29.8178015Z         PASS [   0.172s] ( 810/2567) spt-daemon effect::tests::ptywrite_skips_the_durable_journal_write_while_netsend_persists
2026-08-18T01:05:29.8180630Z         PASS [   0.147s] ( 811/2567) spt-daemon effect::tests::recover_is_migration_free
2026-08-18T01:05:29.8191159Z         PASS [   0.076s] ( 812/2567) spt::bin/spt api::startup::tests::stale_seed_refusal_spends_the_seed_no_restore
2026-08-18T01:05:29.8195141Z         PASS [   0.081s] ( 813/2567) spt-daemon effect::tests::shellchan_and_rc_same_session_dont_collide
2026-08-18T01:05:29.8234027Z         PASS [   0.071s] ( 814/2567) spt-daemon effect::tests::with_tracing_retry_passes_through_other_errors
2026-08-18T01:05:29.8262728Z         PASS [   0.056s] ( 815/2567) spt-daemon effect::tests::with_tracing_retry_retries_once_on_no_longer_held
2026-08-18T01:05:29.8264600Z         PASS [   1.984s] ( 816/2567) spt-daemon brainproc::tests::exe_hash_computed_exactly_once_across_n_publishes
2026-08-18T01:05:29.8622884Z         PASS [   0.078s] ( 817/2567) spt-daemon effect::tests::with_tracing_retry_terminal_is_public_language
2026-08-18T01:05:29.8674612Z         PASS [   0.073s] ( 818/2567) spt-daemon failedaddr::tests::a_null_address_records_nothing
2026-08-18T01:05:29.8728498Z         PASS [   0.270s] ( 819/2567) spt-daemon effect::tests::each_named_minter_namespaces_its_ops
2026-08-18T01:05:29.8730589Z         PASS [   0.056s] ( 820/2567) spt-daemon failedaddr::tests::a_successful_dial_clears_the_record
2026-08-18T01:05:29.8800457Z         PASS [   0.062s] ( 821/2567) spt-daemon failedaddr::tests::an_expired_record_stops_matching_and_is_swept
2026-08-18T01:05:29.8856850Z         PASS [   0.067s] ( 822/2567) spt-daemon failedaddr::tests::connecting_to_a_peer_clears_only_that_peers_records
2026-08-18T01:05:29.8936630Z         PASS [   0.074s] ( 823/2567) spt-daemon failedaddr::tests::matches_the_exact_address_and_no_other
2026-08-18T01:05:29.8973818Z         PASS [   0.078s] ( 824/2567) spt::bin/spt api::startup::tests::stale_seed_with_dead_anchor_refused
2026-08-18T01:05:29.8989939Z         PASS [   0.076s] ( 825/2567) spt-daemon firewall::tests::a_deny_line_naming_the_port_does_not_admit_it
2026-08-18T01:05:29.9037196Z         PASS [   0.077s] ( 826/2567) spt-daemon firewall::tests::a_disabled_manager_does_not_shadow_the_backend
2026-08-18T01:05:29.9079312Z         PASS [   0.081s] ( 827/2567) spt-daemon firewall::tests::a_live_manager_outranks_its_backend
2026-08-18T01:05:29.9123604Z         PASS [   0.050s] ( 828/2567) spt-daemon firewall::tests::active_but_unreadable_is_unverified_not_a_verdict
2026-08-18T01:05:29.9165407Z         PASS [   0.049s] ( 829/2567) spt-daemon firewall::tests::active_ufw_is_decided_against_the_bound_port
2026-08-18T01:05:29.9176059Z         PASS [   0.302s] ( 830/2567) spt-daemon effect::tests::gauntlet_is_exactly_once_across_brain_crashes
2026-08-18T01:05:29.9222190Z         PASS [   0.049s] ( 831/2567) spt-daemon firewall::tests::any_rule_of_the_name_admitting_the_binder_passes
2026-08-18T01:05:29.9265308Z         PASS [   0.053s] ( 832/2567) spt-daemon firewall::tests::no_active_firewall_reads_unknown_and_inactive_ones_are_skipped
2026-08-18T01:05:29.9308496Z         PASS [   0.051s] ( 833/2567) spt-daemon firewall::tests::rule_for_another_binary_is_a_mismatch_not_a_pass
2026-08-18T01:05:29.9345126Z         PASS [   0.049s] ( 834/2567) spt-daemon firewall::tests::rule_for_the_binder_passes_regardless_of_case_or_separators
2026-08-18T01:05:29.9385697Z         PASS [   0.045s] ( 835/2567) spt-daemon firewall::tests::unanswerable_probes_read_unknown_and_no_rule_reads_missing
2026-08-18T01:05:29.9460760Z         PASS [   0.360s] ( 836/2567) spt-daemon drivehub::tests::the_pre_ack_causes_are_three_distinct_diagnostics
2026-08-18T01:05:29.9950653Z         PASS [   0.095s] ( 837/2567) spt-daemon forkop::tests::forking_into_the_reserved_id_is_refused_before_the_mind_is_copied
2026-08-18T01:05:30.0054863Z         PASS [   0.101s] ( 838/2567) spt-daemon frame::tests::envelope_with_unknown_trailing_field_decodes_on_older_peer
2026-08-18T01:05:30.0133490Z         PASS [   0.105s] ( 839/2567) spt-daemon frame::tests::handshake_accepts_newer_brain_on_older_broker
2026-08-18T01:05:30.0136506Z         PASS [   0.116s] ( 840/2567) spt::bin/spt api::startup::tests::successful_bind_consumes_the_seed_exactly_once
2026-08-18T01:05:30.0262440Z         PASS [   0.113s] ( 841/2567) spt-daemon frame::tests::handshake_rejects_below_floor
2026-08-18T01:05:30.0288466Z         PASS [   0.112s] ( 842/2567) spt-daemon frame::tests::handshake_rejects_role_mismatch
2026-08-18T01:05:30.0309791Z         PASS [   0.113s] ( 843/2567) spt-daemon frame::tests::unknown_kind_is_not_a_decode_error
2026-08-18T01:05:30.0353791Z         PASS [   0.113s] ( 844/2567) spt-daemon grants::tests::escalation_answers_apply
2026-08-18T01:05:30.0811723Z         PASS [   0.155s] ( 845/2567) spt-daemon grants::tests::escalation_ask_body_roundtrip
2026-08-18T01:05:30.0921838Z         PASS [   0.158s] ( 846/2567) spt-daemon grants::tests::no_session_escalates_with_none_target
2026-08-18T01:05:30.0984011Z         PASS [   0.160s] ( 847/2567) spt-daemon grants::tests::preconsent_flags_author_grants
2026-08-18T01:05:30.1038388Z         PASS [   0.158s] ( 848/2567) spt-daemon grants::tests::reserved_capabilities_refuse_even_when_granted
2026-08-18T01:05:30.1082717Z         PASS [   0.114s] ( 849/2567) spt-daemon grants::tests::ungranted_escalates_granted_allows
2026-08-18T01:05:30.1140896Z         PASS [   0.109s] ( 850/2567) spt-daemon harnesshost::tests::mint_session_id_is_fresh_hex
2026-08-18T01:05:30.1191133Z         PASS [   0.106s] ( 851/2567) spt-daemon harnesshost::tests::node_key_fills_advertised_label_in_session_template
2026-08-18T01:05:30.1297352Z         PASS [   0.104s] ( 852/2567) spt-daemon harnesshost::tests::node_missing_reference_fails_loud
2026-08-18T01:05:30.1805240Z         PASS [   0.152s] ( 853/2567) spt-daemon harnesshost::tests::prepare_fails_closed_on_wrong_kind_missing_role_and_bad_template
2026-08-18T01:05:30.1974447Z         PASS [   0.166s] ( 854/2567) spt-daemon harnesshost::tests::prepare_fills_env_inject_values_with_substitution
2026-08-18T01:05:30.2023070Z         PASS [   0.167s] ( 855/2567) spt-daemon harnesshost::tests::prepare_fills_id_and_session_into_self_command
2026-08-18T01:05:30.2073367Z         PASS [   0.126s] ( 856/2567) spt-daemon harnesshost::tests::prepare_resume_falls_back_to_self_when_no_resume_role
2026-08-18T01:05:30.2127640Z         PASS [   0.121s] ( 857/2567) spt-daemon harnesshost::tests::prepare_selects_resume_template_on_resume_else_self
2026-08-18T01:05:30.2172082Z         PASS [   0.119s] ( 858/2567) spt-daemon harnesshost::tests::prepare_threads_translation_binary_when_declared
2026-08-18T01:05:30.2224663Z         PASS [   0.119s] ( 859/2567) spt-daemon harnesshost::tests::provisional_session_id_recognizes_own_mint_only
2026-08-18T01:05:30.2323687Z         PASS [   0.124s] ( 860/2567) spt-daemon harnesshost::tests::translation_binary_resolves_against_install_dir
2026-08-18T01:05:30.3660090Z         PASS [   0.435s] ( 861/2567) spt-daemon grants::tests::escalation_notif_fires_to_most_recent_and_roundtrips
2026-08-18T01:05:30.4244937Z         PASS [   0.294s] ( 862/2567) spt-daemon lifecycle::tests::a_seeded_ingest_fault_survives_a_turn_success_after_a_restart
2026-08-18T01:05:30.4636324Z         PASS [   0.256s] ( 863/2567) spt-daemon lifecycle::tests::base_keys_carries_single_subnet_no_home
2026-08-18T01:05:30.4653877Z         PASS [   0.263s] ( 864/2567) spt-daemon lifecycle::tests::any_kind_success_clears_timeouts_but_only_its_own_hard_counter
2026-08-18T01:05:30.4724942Z         PASS [   0.250s] ( 865/2567) spt-daemon lifecycle::tests::custody_survives_parent_boundary_and_reseed_clears
2026-08-18T01:05:30.4728853Z         PASS [   0.292s] ( 866/2567) spt-daemon lifecycle::tests::a_slotless_stamp_seeds_nothing_and_an_unknown_slot_is_ignored
2026-08-18T01:05:30.4981962Z         PASS [   0.132s] ( 867/2567) spt-daemon lifecycle::tests::echo_fire_skips_loud_on_relative_dir_without_cwd
2026-08-18T01:05:30.5246929Z         PASS [   0.061s] ( 868/2567) spt-daemon lifecycle::tests::event_turn_bound_follows_the_role_not_the_pulse
2026-08-18T01:05:30.5565965Z         PASS [   0.344s] ( 869/2567) spt-daemon lifecycle::tests::crash_signoff_spares_recovered_self
2026-08-18T01:05:30.5568302Z         PASS [   0.339s] ( 870/2567) spt-daemon lifecycle::tests::crash_signoff_tears_down_when_still_gone
2026-08-18T01:05:30.5677836Z         PASS [   0.335s] ( 871/2567) spt-daemon lifecycle::tests::echo_fire_resolves_relative_commune_dir_against_endpoint_cwd
2026-08-18T01:05:30.5777502Z         PASS [   0.112s] ( 872/2567) spt-daemon lifecycle::tests::first_turn_psyche_context_is_never_empty
2026-08-18T01:05:30.6092131Z         PASS [   1.190s] ( 873/2567) spt-daemon dispatch::tests::the_relay_observation_is_a_real_connect_and_a_gone_listener_never_reads_offline
2026-08-18T01:05:30.6276762Z         PASS [   0.513s] ( 874/2567) spt-daemon inject::tests::has_parked_idle_spool_gates_on_idle_hosted_and_pending
2026-08-18T01:05:30.6307822Z         PASS [   0.511s] ( 875/2567) spt-daemon inject::tests::shared_inject_leg_detects_spt_hosted
2026-08-18T01:05:30.6761575Z         PASS [   0.204s] ( 876/2567) spt-daemon lifecycle::tests::harness_owner_gone_anchors_on_parent_pid
2026-08-18T01:05:30.7026182Z         PASS [   0.204s] ( 877/2567) spt-daemon lifecycle::tests::is_owlery_internal_cases
2026-08-18T01:05:30.7395334Z         PASS [   0.183s] ( 878/2567) spt-daemon lifecycle::tests::node_key_fills_advertised_label_in_lifecycle_base_keys
2026-08-18T01:05:30.7405558Z         PASS [   0.216s] ( 879/2567) spt-daemon lifecycle::tests::manifest_cell_refresh_swaps_manifest_and_runtime
2026-08-18T01:05:30.7729697Z         PASS [   0.196s] ( 880/2567) spt-daemon lifecycle::tests::outcome_classifies_by_type_never_by_message
2026-08-18T01:05:30.7778451Z         PASS [   0.169s] ( 881/2567) spt-daemon lifecycle::tests::outcome_names_its_leg_and_turn_failure_wins
2026-08-18T01:05:30.7871895Z         PASS [   0.157s] ( 882/2567) spt-daemon lifecycle::tests::psyche_turn_keys_carry_custody_sids_and_context_file_path
2026-08-18T01:05:30.7921275Z         PASS [   0.116s] ( 883/2567) spt-daemon lifecycle::tests::psyche_turn_strikes_exhausted_boundary
2026-08-18T01:05:30.8671675Z         PASS [   0.239s] ( 884/2567) spt-daemon lifecycle::tests::psyche_context_file_continue_is_zero_bytes_fresh_is_nonempty
2026-08-18T01:05:30.8689185Z         PASS [   0.301s] ( 885/2567) spt-daemon lifecycle::tests::orphan_watch_honors_stop_for_live_owner
2026-08-18T01:05:30.9148533Z         PASS [   0.175s] ( 886/2567) spt-daemon lifecycle::tests::pulse_loop_does_not_write_anchor_per_fire
2026-08-18T01:05:30.9163905Z         PASS [   0.176s] ( 887/2567) spt-daemon lifecycle::tests::pulse_loop_is_config_paced_and_killable
2026-08-18T01:05:30.9172720Z         PASS [   0.051s] ( 888/2567) spt-daemon lifecycle::tests::reload_fires_on_disk_change
2026-08-18T01:05:30.9335141Z         PASS [   0.160s] ( 889/2567) spt-daemon lifecycle::tests::pulse_loop_update_preserves_phase_crash_rebases
2026-08-18T01:05:30.9763840Z         PASS [   0.061s] ( 890/2567) spt-daemon lifecycle::tests::reload_noop_when_unchanged
2026-08-18T01:05:30.9793445Z         PASS [   0.110s] ( 891/2567) spt-daemon lifecycle::tests::reload_keeps_last_good_on_unparseable
2026-08-18T01:05:30.9799226Z         PASS [   0.507s] ( 892/2567) spt-daemon lifecycle::tests::ingest_hard_failures_stamp_even_while_turns_succeed
2026-08-18T01:05:30.9804905Z         PASS [   0.203s] ( 893/2567) spt-daemon lifecycle::tests::pulse_recency_and_auto_suspend_follow_resting_state
2026-08-18T01:05:31.0060369Z         PASS [   0.449s] ( 894/2567) spt-daemon lifecycle::tests::orphan_watch_fires_on_dead_owner
2026-08-18T01:05:31.0150367Z         PASS [   0.099s] ( 895/2567) spt-daemon lifecycle::tests::reload_noop_without_install_dir
2026-08-18T01:05:31.0501147Z         PASS [   1.036s] ( 896/2567) spt::bin/spt api::startup::tests::the_escape_the_refusal_names_actually_clears_it
2026-08-18T01:05:31.0708571Z         PASS [   0.153s] ( 897/2567) spt-daemon lifecycle::tests::resolve_endpoint_drop_dir_cases
2026-08-18T01:05:31.1138855Z         PASS [   0.411s] ( 898/2567) spt-daemon lifecycle::tests::psyche_turn_threads_parent_read_env_into_spawn
2026-08-18T01:05:31.1336752Z         PASS [   0.154s] ( 899/2567) spt-daemon lifecycle::tests::session_not_found_discriminates_reseed_from_strike
2026-08-18T01:05:31.2223458Z         PASS [   0.172s] ( 900/2567) spt::bin/spt api::startup::tests::the_pid_role_is_stamped_from_the_entry_path
2026-08-18T01:05:31.2886143Z         PASS [   0.355s] ( 901/2567) spt-daemon lifecycle::tests::rest_edge_echo_success_clears_stale_psyche_stamp
2026-08-18T01:05:31.3898966Z         PASS [   0.167s] ( 902/2567) spt::bin/spt api::startup::tests::valid_seed_binds_live_perch
2026-08-18T01:05:31.4032639Z         PASS [   0.332s] ( 903/2567) spt-daemon lifecycle::tests::turn_budget_stamps_on_exhaustion_and_clears_on_success
2026-08-18T01:05:31.4067684Z         PASS [   0.273s] ( 904/2567) spt-daemon linkhost::tests::force_on_an_offline_instance_is_the_plain_relink
2026-08-18T01:05:31.4303130Z         PASS [   0.415s] ( 905/2567) spt-daemon lifecycle::tests::timeout_budget_is_ten_deep_not_three
2026-08-18T01:05:31.4439011Z         PASS [   0.463s] ( 906/2567) spt-daemon lifecycle::tests::the_expectation_is_recorded_before_the_spawn_not_after
2026-08-18T01:05:31.5218747Z         PASS [   0.516s] ( 907/2567) spt-daemon lifecycle::tests::thrash_budget_trips_on_a_synthetic_failure_loop_without_touching_status
2026-08-18T01:05:31.5552452Z         PASS [   0.267s] ( 908/2567) spt-daemon linkhost::tests::force_refuses_an_ephemeral_instance_and_moves_nothing
2026-08-18T01:05:31.7362462Z         PASS [   0.330s] ( 909/2567) spt-daemon linkhost::tests::per_capability_act_gate_blocks_until_class_scoped_grant
2026-08-18T01:05:31.7397834Z         PASS [   0.626s] ( 910/2567) spt-daemon linkhost::tests::cmd_wakes_a_stale_online_persistent_instance
2026-08-18T01:05:31.7802515Z         PASS [   0.804s] ( 911/2567) spt-daemon lifecycle::tests::rest_event_fires_echo_once_and_wake_resurfaces
2026-08-18T01:05:31.9162970Z         PASS [   0.937s] ( 912/2567) spt-daemon lifecycle::tests::role_less_manifest_ticks_strike_free
2026-08-18T01:05:32.0340411Z         PASS [   0.631s] ( 913/2567) spt-daemon linkhost::tests::gateway_typed_owner_resolves_and_drives_keyed_on_id_not_type
2026-08-18T01:05:32.0519849Z         PASS [   0.622s] ( 914/2567) spt-daemon linkhost::tests::prepare_drive_is_live_or_drop_and_never_spools
2026-08-18T01:05:32.0690119Z         PASS [   0.547s] ( 915/2567) spt-daemon linkhost::tests::run_action_drive_drops_offline_without_wake_or_spool
2026-08-18T01:05:32.1581990Z         PASS [   0.603s] ( 916/2567) spt-daemon linkhost::tests::run_action_honors_the_force_arg
2026-08-18T01:05:32.1666933Z         PASS [   0.723s] ( 917/2567) spt-daemon linkhost::tests::relink_refuses_a_live_instance_but_recovers_a_stale_online_one
2026-08-18T01:05:32.4699867Z         PASS [   0.690s] ( 918/2567) spt-daemon linkhost::tests::survivor_probe_separates_our_binary_from_a_recycled_pid
2026-08-18T01:05:32.4911542Z         PASS [   0.755s] ( 919/2567) spt-daemon linkhost::tests::run_action_refuses_gated_op_without_spooling
2026-08-18T01:05:32.6170752Z         PASS [   0.701s] ( 920/2567) spt-daemon machineid::tests::hash_is_domain_separated_and_stable
2026-08-18T01:05:32.7099195Z         PASS [   0.676s] ( 921/2567) spt-daemon machineid::tests::machine_id_hash_resolves_and_is_stable
2026-08-18T01:05:32.7590220Z         PASS [   1.019s] ( 922/2567) spt-daemon linkhost::tests::run_action_relinks_drives_and_refuses
2026-08-18T01:05:32.8011007Z         PASS [   0.749s] ( 923/2567) spt-daemon msg::tests::bytes_round_trip_through_payload
2026-08-18T01:05:32.8464871Z         PASS [   0.777s] ( 924/2567) spt-daemon msg::tests::endpoint_injected_envelope_carries_delivered_and_spool_hint
2026-08-18T01:05:32.9751050Z         PASS [   0.817s] ( 925/2567) spt-daemon msg::tests::endpoint_input_frames_round_trip
2026-08-18T01:05:33.0203301Z         PASS [   0.854s] ( 926/2567) spt-daemon msg::tests::evicted_envelope_round_trips
2026-08-18T01:05:33.0673978Z         PASS [   0.597s] ( 927/2567) spt-daemon msg::tests::input_req_absent_ack_defaults_true_n_minus_1_safe
2026-08-18T01:05:33.1573269Z         PASS [   0.666s] ( 928/2567) spt-daemon msg::tests::input_req_ack_false_round_trips_faithfully
2026-08-18T01:05:33.2532875Z         PASS [   0.636s] ( 929/2567) spt-daemon msg::tests::net_frames_round_trip_and_tolerate_unknown_fields
2026-08-18T01:05:33.3446976Z         PASS [   0.635s] ( 930/2567) spt-daemon msg::tests::output_envelope_round_trips
2026-08-18T01:05:33.4393917Z         PASS [   2.049s] ( 931/2567) spt::bin/spt rc::tests::attach_viewport_reconnects_across_a_broker_bounce
2026-08-18T01:05:33.4819314Z         PASS [   0.723s] ( 932/2567) spt-daemon msg::tests::output_sync_flag_defaults_absent_and_skips_when_false
2026-08-18T01:05:33.5288119Z         PASS [   0.728s] ( 933/2567) spt-daemon msg::tests::presence_event_round_trips_and_tolerates_future_kind
2026-08-18T01:05:33.5774094Z         PASS [   0.731s] ( 934/2567) spt-daemon msg::tests::spawn_req_tolerates_unknown_field
2026-08-18T01:05:33.6676078Z         PASS [   0.692s] ( 935/2567) spt-daemon msg::tests::stream_lifetime_is_additive_and_defaults_durable
2026-08-18T01:05:33.7140765Z         PASS [   0.694s] ( 936/2567) spt-daemon msg::tests::two_phase_join_wire_round_trips
2026-08-18T01:05:33.7645881Z         PASS [   0.697s] ( 937/2567) spt-daemon msg::tests::wire_decodes_old_shape_to_legacy
2026-08-18T01:05:33.7936922Z         PASS [   3.596s] ( 938/2567) spt-daemon lifecycle::tests::an_ingest_consumes_the_standing_expectation
2026-08-18T01:05:33.8295984Z         PASS [   0.576s] ( 939/2567) spt-daemon nethost::tests::attach_replay_never_interleaves_with_concurrent_live_appends
2026-08-18T01:05:33.8297129Z         PASS [   0.672s] ( 940/2567) spt-daemon nethost::tests::append_halts_at_first_failed_write_removes_the_seat_and_cancels_the_lease
2026-08-18T01:05:33.8803416Z         PASS [   0.535s] ( 941/2567) spt-daemon nethost::tests::begin_attach_refuses_only_while_a_poisoned_prior_still_drains
2026-08-18T01:05:33.8851161Z         PASS [   0.446s] ( 942/2567) spt::bin/spt rc::tests::broker_host_child
2026-08-18T01:05:34.0108300Z         PASS [   0.343s] ( 943/2567) spt-daemon nethost::tests::displaced_writer_failure_never_cancels_the_successor_lease
2026-08-18T01:05:34.0166918Z         PASS [   0.252s] ( 944/2567) spt-daemon nethost::tests::home_relay_reads_a_real_serialized_endpoint_addr
2026-08-18T01:05:34.0167684Z         PASS [   0.303s] ( 945/2567) spt-daemon nethost::tests::finish_halts_and_removes_a_poisoned_seat
2026-08-18T01:05:34.0248814Z         PASS [   0.447s] ( 946/2567) spt-daemon nethost::tests::dispatch_stream_infos_excludes_local_and_retired_rows_server_side
2026-08-18T01:05:34.0940020Z         PASS [   0.213s] ( 947/2567) spt-daemon nethost::tests::next_seq_counts_appends_not_logical_chunks
2026-08-18T01:05:34.0955986Z         PASS [   0.614s] ( 948/2567) spt-daemon nethost::tests::bounded_block_on_cuts_a_never_completing_op_with_an_ordinary_error
2026-08-18T01:05:34.1036743Z         PASS [   0.310s] ( 949/2567) spt-daemon nethost::tests::host_binds_endpoint_to_node_identity
2026-08-18T01:05:34.1042826Z         PASS [   0.275s] ( 950/2567) spt-daemon nethost::tests::loopback_conn_is_a_reused_singleton_that_cross_wires_a_stream_pair
2026-08-18T01:05:34.1293999Z         PASS [   3.705s] ( 951/2567) spt-daemon lifecycle::tests::empty_sweep_yields_no_outcome_while_a_real_ingest_yields_success
2026-08-18T01:05:34.1700827Z         PASS [   0.153s] ( 952/2567) spt-daemon nethost::tests::opener_capture_gives_up_bounded_on_a_newline_less_stream
2026-08-18T01:05:34.1825028Z         PASS [   0.172s] ( 953/2567) spt-daemon nethost::tests::op_maps_are_minter_namespaced
2026-08-18T01:05:34.2212199Z         PASS [   0.196s] ( 954/2567) spt-daemon nethost::tests::opener_pins_first_line_across_full_ring_roll
2026-08-18T01:05:34.2360068Z         PASS [   0.142s] ( 955/2567) spt-daemon nethost::tests::overflow_detaches_without_lease_cancel_and_the_brain_resumes_from_cursor
2026-08-18T01:05:34.2398595Z         PASS [   0.144s] ( 956/2567) spt-daemon nethost::tests::presence_log_mirrors_the_seat_discipline
2026-08-18T01:05:34.2435203Z         PASS [   0.227s] ( 957/2567) spt-daemon nethost::tests::open_class_routes_to_the_opener_row_only
2026-08-18T01:05:34.2802889Z         PASS [   0.176s] ( 958/2567) spt-daemon nethost::tests::retentive_log_is_lossless_ordered_while_ordinary_log_overwrites
2026-08-18T01:05:34.3236221Z         PASS [   3.536s] ( 959/2567) spt-daemon lifecycle::tests::pulse_tick_ingests_drop
2026-08-18T01:05:34.3780483Z         PASS [   0.849s] ( 960/2567) spt-daemon nethost::tests::conn_close_sweeps_its_stream_rows
2026-08-18T01:05:34.3850563Z         PASS [   0.202s] ( 961/2567) spt-daemon nethost::tests::send_stream_refuses_on_a_canceled_lease
2026-08-18T01:05:34.3851321Z         PASS [   0.256s] ( 962/2567) spt-daemon nethost::tests::retire_sweep_dismisses_the_seat_and_terminal_retire_drops_the_row
2026-08-18T01:05:34.3872730Z         PASS [   0.283s] ( 963/2567) spt-daemon nethost::tests::retire_hides_the_row_while_active_rows_stay
2026-08-18T01:05:34.4005249Z         PASS [   0.230s] ( 964/2567) spt-daemon nethost::tests::retired_row_still_flushes_a_late_reply
2026-08-18T01:05:34.4133120Z         PASS [   0.177s] ( 965/2567) spt-daemon nethost::tests::unsubscribe_releases_only_the_callers_seat_joins_writer_and_is_idempotent
2026-08-18T01:05:34.4238083Z         PASS [   0.203s] ( 966/2567) spt-daemon nethost::tests::two_hosts_dial_over_loopback
2026-08-18T01:05:34.7649735Z         PASS [   0.521s] ( 967/2567) spt-daemon notif::tests::expired_row_is_auto_dismissed_at_boundary_not_surfaced
2026-08-18T01:05:34.7767291Z         PASS [   0.496s] ( 968/2567) spt-daemon notif::tests::first_fire_declines_an_already_expired_row
2026-08-18T01:05:34.7793095Z         PASS [   0.539s] ( 969/2567) spt-daemon notif::tests::consent_decision_produces_notif_only_when_gated
2026-08-18T01:05:34.7796941Z         PASS [   0.379s] ( 970/2567) spt-daemon notif::tests::no_live_endpoint_is_a_typed_no_target
2026-08-18T01:05:34.8112317Z         PASS [   0.387s] ( 971/2567) spt-daemon notif::tests::notif_command_renders_all_keys_and_is_opt_in
2026-08-18T01:05:34.8302103Z         PASS [   0.445s] ( 972/2567) spt-daemon notif::tests::hidden_endpoint_boundary_surfaces_nothing
2026-08-18T01:05:34.8975241Z         PASS [   0.520s] ( 973/2567) spt-daemon notif::tests::first_fire_redirects_to_a_fresher_remote_winner_unmarked
2026-08-18T01:05:34.9077666Z         PASS [   0.523s] ( 974/2567) spt-daemon notif::tests::first_fire_rides_the_quiet_window_not_the_live_stream
2026-08-18T01:05:35.0010110Z         PASS [   0.677s] ( 975/2567) spt-daemon notif::tests::first_fire_reaches_most_recent_visible_endpoint
2026-08-18T01:05:35.0027736Z         PASS [   0.616s] ( 976/2567) spt-daemon notif::tests::hidden_endpoint_is_never_the_target
2026-08-18T01:05:35.0182497Z         PASS [   0.605s] ( 977/2567) spt-daemon notif::tests::node_scoped_first_fire_ignores_a_fresher_remote_winner
2026-08-18T01:05:35.1208178Z         PASS [   0.309s] ( 978/2567) spt-daemon notifgate::tests::an_unvalidatable_notify_passes
2026-08-18T01:05:35.1698694Z         PASS [   1.340s] ( 979/2567) spt-daemon nethost::tests::loopback_tunnel_backpressures_without_loss
2026-08-18T01:05:35.2138158Z         PASS [   0.384s] ( 980/2567) spt-daemon notifgate::tests::distinct_notifs_both_deliver
2026-08-18T01:05:35.2831426Z         PASS [   0.504s] ( 981/2567) spt-daemon notif::tests::shell_notif_templates_render_for_attached_instances_only
2026-08-18T01:05:35.3090328Z         PASS [   0.411s] ( 982/2567) spt-daemon notifgate::tests::retain_preserves_order_of_the_survivors
2026-08-18T01:05:35.4202370Z         PASS [   0.655s] ( 983/2567) spt-daemon notif::tests::resurface_delivers_undismissed_with_gates
2026-08-18T01:05:35.4394368Z         PASS [   0.532s] ( 984/2567) spt-daemon notifgate::tests::the_validity_gate_decision_table
2026-08-18T01:05:35.5079273Z         PASS [   0.731s] ( 985/2567) spt-daemon notif::tests::rollback_notif_is_loud_and_resurfaces
2026-08-18T01:05:35.5254785Z         PASS [   0.746s] ( 986/2567) spt-daemon notif::tests::suppression_window_holds_cross_endpoint
2026-08-18T01:05:35.7394885Z         PASS [   0.738s] ( 987/2567) spt-daemon notifsync::tests::concurrent_dismiss_and_surface_commute_across_the_feed
2026-08-18T01:05:35.7974819Z         PASS [   0.795s] ( 988/2567) spt-daemon notifsync::tests::feed_converges_two_stores_and_dismiss_replicates
2026-08-18T01:05:35.8105140Z         PASS [  12.293s] ( 989/2567) spt::bin/spt cli::tests::shell_spawn_gates_on_the_registered_set
2026-08-18T01:05:35.9101487Z         PASS [   0.892s] ( 990/2567) spt-daemon notifsync::tests::node_scoped_rows_are_excluded_from_the_feed
2026-08-18T01:05:36.0321061Z         PASS [   0.911s] ( 991/2567) spt-daemon notifsync::tests::non_member_subnet_record_never_materializes
2026-08-18T01:05:36.1705526Z         PASS [   1.001s] ( 992/2567) spt-daemon notifsync::tests::untrusted_and_cross_subnet_origins_are_dropped
2026-08-18T01:05:36.1806070Z         PASS [   0.967s] ( 993/2567) spt-daemon pairhost::tests::a_re_postured_subnet_advises_and_never_applies
2026-08-18T01:05:36.1932862Z         PASS [   0.884s] ( 994/2567) spt-daemon pairhost::tests::joiner_clock_render_shows_step_offset_and_state
2026-08-18T01:05:36.1995118Z         PASS [   0.779s] ( 995/2567) spt-daemon pairhost::tests::meet_failure_detail_concise_vs_verbose
2026-08-18T01:05:36.2103839Z         PASS [   0.771s] ( 996/2567) spt-daemon pairhost::tests::meet_final_retry_failing_surrenders_once
2026-08-18T01:05:36.2141839Z         PASS [   0.706s] ( 997/2567) spt-daemon pairhost::tests::meet_retries_once_after_refresh_on_exhaustion
2026-08-18T01:05:36.2196863Z         PASS [   0.694s] ( 998/2567) spt-daemon pairhost::tests::the_advisory_says_nothing_was_applied
2026-08-18T01:05:36.2276456Z         PASS [   0.488s] ( 999/2567) spt-daemon pairhost::tests::wire_errors_classify_for_the_guided_ux
2026-08-18T01:05:36.2624346Z         PASS [   0.352s] (1000/2567) spt-daemon presence::tests::snapshot_loading_degrades_on_junk
2026-08-18T01:05:36.2907225Z         PASS [   0.493s] (1001/2567) spt-daemon presence::tests::mra_degrades_to_local_and_skips_noise_rows
2026-08-18T01:05:36.3437842Z         PASS [   1.061s] (1002/2567) spt-daemon pairhost::tests::an_advisory_records_the_sighting_and_still_applies_nothing
2026-08-18T01:05:36.3454194Z         PASS [   0.535s] (1003/2567) spt-daemon presence::tests::mra_joins_local_and_gossiped_legs_under_one_max
2026-08-18T01:05:36.3483532Z         PASS [   0.153s] (1004/2567) spt-daemon projwriter::tests::corrupt_index_is_repaired_and_counted
2026-08-18T01:05:36.3516747Z         PASS [   0.171s] (1005/2567) spt-daemon projwriter::tests::cold_construct_spawns_no_git_and_first_cycle_publishes
2026-08-18T01:05:36.3554388Z         PASS [   0.323s] (1006/2567) spt-daemon presence::tests::subnet_scope_gates_both_legs
2026-08-18T01:05:36.4046887Z         PASS [   0.061s] (1007/2567) spt-daemon propagate::tests::classifier_maps_every_status_shape
2026-08-18T01:05:36.4996700Z         PASS [   2.614s] (1008/2567) spt::bin/spt rc::tests::qualified_targets_attach_with_bare_wire_id
2026-08-18T01:05:36.5747915Z         PASS [   0.075s] (1009/2567) spt::bin/spt rc::tests::reconnect_class_only_severed_transport_redrives
2026-08-18T01:05:36.6044848Z         PASS [   0.030s] (1010/2567) spt::bin/spt wansend::tests::a_knock_reports_only_what_the_far_end_confirmed
2026-08-18T01:05:36.6825270Z         PASS [   0.078s] (1011/2567) spt::bin/spt wansend::tests::a_shared_short_key_refuses_and_an_unknown_one_is_its_own_outcome
2026-08-18T01:05:36.7327013Z         PASS [   0.050s] (1012/2567) spt::bin/spt wansend::tests::a_short_key_resolves_through_each_node_tier_carrier_alone
2026-08-18T01:05:36.7493756Z         PASS [   0.394s] (1013/2567) spt-daemon psyrelay::tests::null_stdout_driver_fails_the_guard
2026-08-18T01:05:36.8003188Z         PASS [   0.067s] (1014/2567) spt::bin/spt wansend::tests::an_explicit_override_outranks_the_ownership_scope
2026-08-18T01:05:36.8744610Z         PASS [   0.074s] (1015/2567) spt::bin/spt wansend::tests::an_unanswered_fork_is_unconfirmed_and_never_reported_as_done
2026-08-18T01:05:36.9055293Z         PASS [   0.031s] (1016/2567) spt::bin/spt wansend::tests::bare_id_resolves_across_remote_snapshot
2026-08-18T01:05:36.9123432Z         PASS [   0.508s] (1017/2567) spt-daemon psyrelay::tests::prose_only_relays_nothing
2026-08-18T01:05:36.9171243Z         PASS [   0.572s] (1018/2567) spt-daemon psyrelay::tests::empty_and_oversize_bodies_drop_typed
2026-08-18T01:05:36.9359492Z         PASS [   0.736s] (1019/2567) spt-daemon projwriter::tests::cwd_invalidation_evicts_shared_cache_entry
2026-08-18T01:05:36.9787807Z         PASS [   0.631s] (1020/2567) spt-daemon psyrelay::tests::notify_reaches_own_user_only
2026-08-18T01:05:36.9791148Z         PASS [   0.072s] (1021/2567) spt::bin/spt wansend::tests::classify_wan_reply_only_delivers_on_positive_outcomes
2026-08-18T01:05:36.9873291Z         PASS [   0.636s] (1022/2567) spt-daemon psyrelay::tests::notify_without_live_endpoint_is_pending
2026-08-18T01:05:37.0121331Z         PASS [   0.076s] (1023/2567) spt-daemon pump::health::tests::a_failing_peer_whose_node_the_registry_reports_offline_reads_absent_not_degraded
2026-08-18T01:05:37.0260802Z         PASS [   0.048s] (1024/2567) spt-daemon pump::health::tests::a_non_target_connection_never_counts_and_disconnects_mirror_the_conn_set
2026-08-18T01:05:37.0336508Z         PASS [   0.053s] (1025/2567) spt::bin/spt wansend::tests::hide_new_reaches_this_nodes_ids_and_no_further
2026-08-18T01:05:37.0346179Z         PASS [   0.047s] (1026/2567) spt-daemon pump::health::tests::a_subnet_leave_re_derives_the_live_count_without_disconnecting_anybody
2026-08-18T01:05:37.0421984Z         PASS [   0.029s] (1027/2567) spt-daemon pump::health::tests::a_target_leaving_the_roster_drops_its_failure_and_can_return_the_node_to_green
2026-08-18T01:05:37.0501172Z         PASS [   0.025s] (1028/2567) spt-daemon pump::health::tests::degraded_on_all_peer_failure_healthy_only_on_real_progress
2026-08-18T01:05:37.1198810Z         PASS [   0.086s] (1029/2567) spt::bin/spt wansend::tests::load_snapshots_degrades_on_junk
2026-08-18T01:05:37.1226001Z         PASS [   0.088s] (1030/2567) spt-daemon pump::health::tests::five_of_seven_failing_behind_two_live_peers_is_degraded_partial_never_healthy
2026-08-18T01:05:37.1367904Z         PASS [   0.086s] (1031/2567) spt-daemon pump::health::tests::one_peer_reconnecting_narrows_the_verdict_without_restarting_the_incident_clock
2026-08-18T01:05:37.1391857Z         PASS [   0.098s] (1032/2567) spt-daemon pump::health::tests::health_file_roundtrip_and_degrade
2026-08-18T01:05:37.4158107Z         PASS [   0.296s] (1033/2567) spt::bin/spt wansend::tests::refusals_render_copy_paste_targets
2026-08-18T01:05:37.4205510Z         PASS [   0.298s] (1034/2567) spt-daemon pump::health::tests::one_unaccounted_failing_peer_holds_the_degraded_partial_verdict
2026-08-18T01:05:37.4259674Z         PASS [   0.289s] (1035/2567) spt-daemon pump::health::tests::peers_absent_replaces_only_a_degraded_verdict_and_never_outlives_its_target
2026-08-18T01:05:37.8946751Z         PASS [   0.474s] (1036/2567) spt-daemon pump::health::tests::stage_parses_from_attributed_reasons
2026-08-18T01:05:37.8953815Z         PASS [   0.756s] (1037/2567) spt-daemon pump::health::tests::registry_admit_stamp_survives_restart_rounds_and_never_regresses
2026-08-18T01:05:37.9024667Z         PASS [   0.476s] (1038/2567) spt-daemon pump::health::tests::stale_gossip_forces_the_conservative_read_even_with_every_node_offline
2026-08-18T01:05:37.9776111Z         PASS [   0.082s] (1039/2567) spt-daemon pump::registry::tests::disclosable_lines_keeps_the_per_subnet_filter
2026-08-18T01:05:38.0293869Z         FAIL [   0.124s] (1040/2567) spt-daemon pump::registry::tests::discover_gate_filters_the_advert_push_per_viewer
2026-08-18T01:05:38.0294569Z   stdout ───
2026-08-18T01:05:38.0294672Z 
2026-08-18T01:05:38.0294749Z     running 1 test
2026-08-18T01:05:38.0295106Z     test pump::registry::tests::discover_gate_filters_the_advert_push_per_viewer ... FAILED
2026-08-18T01:05:38.0295453Z 
2026-08-18T01:05:38.0295518Z     failures:
2026-08-18T01:05:38.0295623Z 
2026-08-18T01:05:38.0295686Z     failures:
2026-08-18T01:05:38.0295947Z         pump::registry::tests::discover_gate_filters_the_advert_push_per_viewer
2026-08-18T01:05:38.0296236Z 
2026-08-18T01:05:38.0296457Z     test result: FAILED. 0 passed; 1 failed; 0 ignored; 0 measured; 834 filtered out; finished in 0.04s
2026-08-18T01:05:38.0296820Z 
2026-08-18T01:05:38.0296930Z   stderr ───
2026-08-18T01:05:38.0297040Z 
2026-08-18T01:05:38.0297520Z     thread 'pump::registry::tests::discover_gate_filters_the_advert_push_per_viewer' (49300) panicked at crates\spt-daemon\src\pump\registry.rs:369:13:
2026-08-18T01:05:38.0298636Z     refused viewer is not told the endpoint exists: {"subnet":"home","endpoint_id":"ling","instance":{"node":"me","status":"Active","epoch":1,"resources":"ling builds rust","bound":true}}
2026-08-18T01:05:38.0299659Z     {"subnet":"home","endpoint_id":"doyle","instance":{"node":"me","status":"Active","epoch":1,"resources":"doyle builds rust","bound":true}}
2026-08-18T01:05:38.0300282Z     {"subnet":"home","node":"me","label":"hfenduleam","epoch":1}
2026-08-18T01:05:38.0300527Z 
2026-08-18T01:05:38.0300738Z     note: run with `RUST_BACKTRACE=1` environment variable to display a backtrace
2026-08-18T01:05:38.0301046Z 
2026-08-18T01:05:38.0301803Z   Cancelling due to test failure: 15 tests still running
2026-08-18T01:05:38.0648420Z         PASS [   0.169s] (1041/2567) spt-daemon pump::registry::tests::disclosable_lines_pushes_the_engine_room_only_to_its_chosen_viewer
2026-08-18T01:05:38.1194906Z         PASS [   1.207s] (1042/2567) spt-daemon psyrelay::tests::reply_without_target_is_dropped
2026-08-18T01:05:38.1465699Z         PASS [   1.856s] (1043/2567) spt-daemon projwriter::tests::writer_thread_debounces_burst_into_one_cycle
2026-08-18T01:05:38.1714089Z         PASS [   0.194s] (1044/2567) spt-daemon pump::registry::tests::fire_due_rotations_rotates_due_and_leaves_pending
2026-08-18T01:05:38.2476858Z         PASS [   1.498s] (1045/2567) spt-daemon psyrelay::tests::reply_relays_to_inbound_sender
2026-08-18T01:05:38.2538171Z         PASS [   2.034s] (1046/2567) spt-daemon projwriter::tests::ordinary_commit_is_noop_config_change_rederives
2026-08-18T01:05:38.3465732Z         PASS [   1.429s] (1047/2567) spt-daemon psyrelay::tests::spoofed_routing_is_stripped_and_restamped
2026-08-18T01:05:38.3655806Z         PASS [   7.573s] (1048/2567) spt-daemon lifecycle::tests::relative_commune_dir_resolves_against_endpoint_cwd_and_fills_project_branch
2026-08-18T01:05:38.5490164Z         PASS [   1.132s] (1049/2567) spt::bin/spt wansend::tests::remote_rest_suspends_and_wakes_with_the_deferred_gate
2026-08-18T01:05:39.0044480Z         PASS [   2.790s] (1050/2567) spt-daemon projwriter::tests::failed_cycle_preserves_last_known_good
2026-08-18T01:05:39.0955618Z         PASS [   2.833s] (1051/2567) spt-daemon projwriter::tests::warm_start_unchanged_generation_scans_nothing
2026-08-18T01:05:39.1000321Z         PASS [   2.890s] (1052/2567) spt-daemon projwriter::tests::endpoint_events_patch_rows_and_drop_purged
2026-08-18T01:05:40.2899527Z         PASS [   4.119s] (1053/2567) spt-daemon projwriter::tests::batched_complexity_counters_hold
2026-08-18T01:05:40.4033792Z         PASS [  17.491s] (1054/2567) spt::bin/spt cli::tests::owner_shutdown_gated_by_can_shutdown_grant
2026-08-18T01:05:41.0006902Z         PASS [   4.773s] (1055/2567) spt-daemon projwriter::tests::parity_full_ordered_list_vs_legacy_oracle
2026-08-18T01:05:41.0009980Z ────────────
2026-08-18T01:05:41.0010219Z      Summary [  21.472s] 1055/2567 tests run: 1054 passed (4 leaky), 1 failed, 1 skipped
2026-08-18T01:05:41.0010623Z         FAIL [   0.124s] (1040/2567) spt-daemon pump::registry::tests::discover_gate_filters_the_advert_push_per_viewer
2026-08-18T01:05:41.0011114Z warning: 1512/2567 tests were not run due to test failure (run with --no-fail-fast to run all tests, or run with --max-fail)
2026-08-18T01:05:41.0075582Z error: test run failed
2026-08-18T01:05:46.1170951Z ##[error]Process completed with exit code 1.
2026-08-18T01:05:46.1523068Z Post job cleanup.
2026-08-18T01:05:46.4112554Z [command]"C:\Program Files\Git\cmd\git.exe" version
2026-08-18T01:05:46.4350963Z git version 2.43.0.windows.1
2026-08-18T01:05:46.4383707Z Copying 'C:\Users\decid\.gitconfig' to 'C:\actions-runner\_work\_temp\d4eacdfe-f7af-4a21-a3aa-70e62556b854\.gitconfig'
2026-08-18T01:05:46.4398302Z Temporarily overriding HOME='C:\actions-runner\_work\_temp\d4eacdfe-f7af-4a21-a3aa-70e62556b854' before making global git config changes
2026-08-18T01:05:46.4399089Z Adding repository directory to the temporary git global config as a safe directory
2026-08-18T01:05:46.4404159Z [command]"C:\Program Files\Git\cmd\git.exe" config --global --add safe.directory C:\actions-runner\_work\spt-bs-core\spt-bs-core
2026-08-18T01:05:46.4683967Z [command]"C:\Program Files\Git\cmd\git.exe" config --local --name-only --get-regexp core\.sshCommand
2026-08-18T01:05:46.4942319Z [command]"C:\Program Files\Git\cmd\git.exe" submodule foreach --recursive "sh -c \"git config --local --name-only --get-regexp 'core\.sshCommand' && git config --local --unset-all 'core.sshCommand' || :\""
2026-08-18T01:05:47.2659942Z [command]"C:\Program Files\Git\cmd\git.exe" config --local --name-only --get-regexp http\.https\:\/\/github\.com\/\.extraheader
2026-08-18T01:05:47.2912650Z http.https://github.com/.extraheader
2026-08-18T01:05:47.2936170Z [command]"C:\Program Files\Git\cmd\git.exe" config --local --unset-all http.https://github.com/.extraheader
2026-08-18T01:05:47.3650096Z [command]"C:\Program Files\Git\cmd\git.exe" submodule foreach --recursive "sh -c \"git config --local --name-only --get-regexp 'http\.https\:\/\/github\.com\/\.extraheader' && git config --local --unset-all 'http.https://github.com/.extraheader' || :\""
2026-08-18T01:05:48.9406088Z [command]"C:\Program Files\Git\cmd\git.exe" config --local --name-only --get-regexp ^includeIf\.gitdir:
2026-08-18T01:05:49.0544433Z [command]"C:\Program Files\Git\cmd\git.exe" submodule foreach --recursive "git config --local --show-origin --name-only --get-regexp remote.origin.url"
2026-08-18T01:05:49.8708514Z Cleaning up orphan processes
2026-08-18T01:05:49.9070239Z Terminate orphan process: pid (50816) (PING)
2026-08-18T01:05:49.9132719Z Terminate orphan process: pid (51072) (PING)
2026-08-18T01:05:49.9181072Z Terminate orphan process: pid (47072) (PING)
2026-08-18T01:05:49.9237329Z Terminate orphan process: pid (11888) (PING)
